public inbox for cygwin@cygwin.com
 help / color / mirror / Atom feed
* Fwd: getcwd in Make's Test Scripts Causes Errors
       [not found] <CAO9FYyF80O81hjwtOmZCOUEOYvxSF48aZcnj4cN5zdFTyJuV9Q@mail.gmail.com>
@ 2013-07-09  5:35 ` GJ
  2013-07-09  5:50   ` marco atzeri
  0 siblings, 1 reply; 2+ messages in thread
From: GJ @ 2013-07-09  5:35 UTC (permalink / raw)
  To: cygwin

[-- Attachment #1: Type: text/plain, Size: 962 bytes --]

Hello,

I'm trying to build Make-3.82 in Cygwin64 1.7.21-6 on Windows 8 x64.
It appears to build just fine, but I can't run the tests.  I've tried
running it with "make check", "perl run_make_tests.pl", and the latter
in Window's own CMD.exe.  When a test fails, it produces the error
"shell-init: error retrieving current directory: getcwd: cannot access
parent directories: No error".

Attached is a cygheck.out, the script I ran to try to build and test
Make in "conf-make-inst.sh", (so it's easy to see how to reproduce the
problem) and the output of the script in "build log.txt".  "build
log.txt" is just the output of "conf-make-inst.sh".  It contains the
output from the configure, make, and make check commands.

I can't seem to find much information on this, or I don't have the
expertise to understand the information out there on errors with
getcwd and Cygwin.  Did I include all the information needed to be
helpful?

Thanks for your consideration.

[-- Attachment #2: build log.txt --]
[-- Type: text/plain, Size: 73682 bytes --]


+++++++++++++++++++++++
Executing "make distclean"
+++++++++++++++++++++++
Making distclean in w32
make[1]: Entering directory `/home/Greg/make-3.82/w32'
test -z "libw32.a" || rm -f libw32.a
rm -f *.o
rm -f *.tab.c
test -z "" || rm -f 
test . = "." || test -z "" || rm -f 
rm -f TAGS ID GTAGS GRTAGS GSYMS GPATH tags
rm -rf ./.deps
rm -f Makefile
make[1]: Leaving directory `/home/Greg/make-3.82/w32'
Making distclean in doc
make[1]: Entering directory `/home/Greg/make-3.82/doc'
test -z "make.dvi make.pdf make.ps make.html" \
|| rm -rf make.dvi make.pdf make.ps make.html
test -z "make*.html" || rm -f make*.html
rm -rf make.aux make.cp make.cps make.fn make.fns make.ky make.kys \
  make.log make.pg make.tmp make.toc make.tp make.tps make.vr
rm -f vti.tmp
test -z "" || rm -f 
test . = "." || test -z "" || rm -f 
rm -f Makefile
make[1]: Leaving directory `/home/Greg/make-3.82/doc'
Making distclean in po
make[1]: Entering directory `/home/Greg/make-3.82/po'
rm -f *.insert-header
rm -f remove-potcdate.sed
rm -f stamp-poT
rm -f core core.* make.po make.1po make.2po *.new.po
rm -fr *.o
rm -f Makefile Makefile.in POTFILES *.mo
make[1]: Leaving directory `/home/Greg/make-3.82/po'
Making distclean in config
make[1]: Entering directory `/home/Greg/make-3.82/config'
test -z "" || rm -f 
test . = "." || test -z "" || rm -f 
rm -f Makefile
make[1]: Leaving directory `/home/Greg/make-3.82/config'
Making distclean in glob
make[1]: Entering directory `/home/Greg/make-3.82/glob'
test -z "libglob.a" || rm -f libglob.a
rm -f *.o
rm -f *.tab.c
test -z "" || rm -f 
test . = "." || test -z "" || rm -f 
rm -f TAGS ID GTAGS GRTAGS GSYMS GPATH tags
rm -rf ./.deps
rm -f Makefile
make[1]: Leaving directory `/home/Greg/make-3.82/glob'
Making distclean in .
make[1]: Entering directory `/home/Greg/make-3.82'
test -z "make.exe" || rm -f make.exe
test -z "loadavg.exe" || rm -f loadavg.exe
rm -f *.o
rm -f *.tab.c
test -z "" || rm -f 
test . = "." || test -z "" || rm -f 
test -z "build.sh" || rm -f build.sh
rm -f config.h stamp-h1
rm -f TAGS ID GTAGS GRTAGS GSYMS GPATH tags
make[1]: Leaving directory `/home/Greg/make-3.82'
rm -f config.status config.cache config.log  configure.lineno config.status.lineno
rm -rf .deps ./.deps
rm -f Makefile

+++++++++++++++++++++++
Executing "./configure"
+++++++++++++++++++++++
checking for a BSD-compatible install... /usr/bin/install -c
checking whether build environment is sane... yes
checking for a thread-safe mkdir -p... /usr/bin/mkdir -p
checking for gawk... gawk
checking whether make sets $(MAKE)... yes
checking for gcc... gcc
checking whether the C compiler works... yes
checking for C compiler default output file name... a.exe
checking for suffix of executables... .exe
checking whether we are cross compiling... no
checking for suffix of object files... o
checking whether we are using the GNU C compiler... yes
checking whether gcc accepts -g... yes
checking for gcc option to accept ISO C89... none needed
checking for style of include used by make... GNU
checking dependency style of gcc... gcc3
checking for ranlib... ranlib
checking how to run the C preprocessor... gcc -E
checking for ar... ar
checking for perl... perl
checking build system type... x86_64-unknown-cygwin
checking host system type... x86_64-unknown-cygwin
checking for grep that handles long lines and -e... /usr/bin/grep
checking for egrep... /usr/bin/grep -E
checking for ANSI C header files... yes
checking for sys/types.h... yes
checking for sys/stat.h... yes
checking for stdlib.h... yes
checking for string.h... yes
checking for memory.h... yes
checking for strings.h... yes
checking for inttypes.h... yes
checking for stdint.h... yes
checking for unistd.h... yes
checking minix/config.h usability... no
checking minix/config.h presence... no
checking for minix/config.h... no
checking whether it is safe to define __EXTENSIONS__... yes
checking for strerror in -lcposix... no
checking whether NLS is requested... yes
checking for msgfmt... /usr/bin/msgfmt
checking for gmsgfmt... /usr/bin/msgfmt
checking for xgettext... /usr/bin/xgettext
checking for msgmerge... /usr/bin/msgmerge
checking for ld used by GCC... /usr/x86_64-pc-cygwin/bin/ld.exe
checking if the linker (/usr/x86_64-pc-cygwin/bin/ld.exe) is GNU ld... yes
checking for shared library run path origin... done
checking whether NLS is requested... yes
checking for GNU gettext in libc... no
checking for iconv... yes
checking how to link with libiconv... /usr/local/lib/libiconv.a
checking for GNU gettext in libintl... yes
checking whether to use NLS... yes
checking where the gettext function comes from... external libintl
checking how to link with libintl... -lintl
checking for special C compiler options needed for large files... no
checking for _FILE_OFFSET_BITS value needed for large files... no
checking for library containing getpwnam... none required
checking for ANSI C header files... (cached) yes
checking for dirent.h that defines DIR... yes
checking for library containing opendir... none required
checking whether stat file-mode macros are broken... no
checking whether time.h and sys/time.h may both be included... yes
checking for stdlib.h... (cached) yes
checking locale.h usability... yes
checking locale.h presence... yes
checking for locale.h... yes
checking for unistd.h... (cached) yes
checking limits.h usability... yes
checking limits.h presence... yes
checking for limits.h... yes
checking fcntl.h usability... yes
checking fcntl.h presence... yes
checking for fcntl.h... yes
checking for string.h... (cached) yes
checking for memory.h... (cached) yes
checking sys/param.h usability... yes
checking sys/param.h presence... yes
checking for sys/param.h... yes
checking sys/resource.h usability... yes
checking sys/resource.h presence... yes
checking for sys/resource.h... yes
checking sys/time.h usability... yes
checking sys/time.h presence... yes
checking for sys/time.h... yes
checking sys/timeb.h usability... yes
checking sys/timeb.h presence... yes
checking for sys/timeb.h... yes
checking stdarg.h usability... yes
checking stdarg.h presence... yes
checking for stdarg.h... yes
checking whether gcc and cc understand -c and -o together... yes
checking for an ANSI C-conforming const... yes
checking return type of signal handlers... void
checking for uid_t in sys/types.h... yes
checking for pid_t... yes
checking for uintmax_t... yes
checking for nanoseconds field of struct stat.st_mtim... tv_nsec
checking whether to use high resolution file timestamps... yes
checking for library containing clock_gettime... none required
checking whether system uses MSDOS-style paths... yes
checking for standard gettimeofday... yes
checking for strdup... yes
checking for strndup... yes
checking for mkstemp... yes
checking for mktemp... yes
checking for fdopen... yes
checking for fileno... yes
checking for dup2... yes
checking for getcwd... yes
checking for realpath... yes
checking for sigsetmask... no
checking for sigaction... yes
checking for getgroups... yes
checking for seteuid... yes
checking for setegid... yes
checking for setlinebuf... yes
checking for setreuid... yes
checking for setregid... yes
checking for getrlimit... yes
checking for setrlimit... yes
checking for setvbuf... yes
checking for pipe... yes
checking for strerror... yes
checking for strsignal... yes
checking for lstat... yes
checking for readlink... yes
checking for atexit... yes
checking whether bsd_signal is declared... no
checking for strcasecmp... yes
checking for strncasecmp... yes
checking for strcmpi... no
checking for strncmpi... no
checking for stricmp... no
checking for strnicmp... no
checking for working strcoll... yes
checking for working alloca.h... yes
checking for alloca... yes
checking vfork.h usability... no
checking vfork.h presence... no
checking for vfork.h... no
checking for fork... yes
checking for vfork... yes
checking for working fork... yes
checking for working vfork... (cached) yes
checking for vprintf... yes
checking for _doprnt... no
checking whether closedir returns void... no
checking for getloadavg... no
checking for pstat_getdynamic... no
checking for kstat_open in -lkstat... no
checking for elf_begin in -lelf... no
checking for kvm_open in -lkvm... no
checking for getloadavg in -lutil... no
checking for getloadavg in -lgetloadavg... no
checking for getloadavg... no
checking sys/dg_sys_info.h usability... no
checking sys/dg_sys_info.h presence... no
checking for sys/dg_sys_info.h... no
checking for locale.h... (cached) yes
checking for setlocale... yes
checking inq_stats/cpustats.h usability... no
checking inq_stats/cpustats.h presence... no
checking for inq_stats/cpustats.h... no
checking sys/cpustats.h usability... no
checking sys/cpustats.h presence... no
checking for sys/cpustats.h... no
checking mach/mach.h usability... no
checking mach/mach.h presence... no
checking for mach/mach.h... no
checking nlist.h usability... no
checking nlist.h presence... no
checking for nlist.h... no
checking whether getloadavg requires setgid... no
checking whether sys_siglist is declared... yes
checking whether _sys_siglist is declared... no
checking whether __sys_siglist is declared... no
checking for sys/wait.h... yes
checking for waitpid... yes
checking for wait3... yes
checking for union wait... no
checking for SA_RESTART... yes
checking for location of SCCS get command... get
checking if system libc has GNU glob... no; using local copy
checking if malloc debugging is wanted... no
configure: creating ./config.status
config.status: creating Makefile
config.status: creating glob/Makefile
config.status: creating po/Makefile.in
config.status: creating config/Makefile
config.status: creating doc/Makefile
config.status: creating w32/Makefile
config.status: creating config.h
config.status: executing depfiles commands
config.status: executing default-1 commands
config.status: creating po/POTFILES
config.status: creating po/Makefile
config.status: creating build.sh

+++++++++++++++++++++++
Executing "make"
+++++++++++++++++++++++
make  all-recursive
make[1]: Entering directory `/home/Greg/make-3.82'
Making all in glob
make[2]: Entering directory `/home/Greg/make-3.82/glob'
gcc -DHAVE_CONFIG_H -I. -I..    -I/usr/local/include   -MT glob.o -MD -MP -MF .deps/glob.Tpo -c -o glob.o glob.c
mv -f .deps/glob.Tpo .deps/glob.Po
gcc -DHAVE_CONFIG_H -I. -I..    -I/usr/local/include   -MT fnmatch.o -MD -MP -MF .deps/fnmatch.Tpo -c -o fnmatch.o fnmatch.c
mv -f .deps/fnmatch.Tpo .deps/fnmatch.Po
rm -f libglob.a
ar cru libglob.a glob.o fnmatch.o 
ranlib libglob.a
make[2]: Leaving directory `/home/Greg/make-3.82/glob'
Making all in config
make[2]: Entering directory `/home/Greg/make-3.82/config'
make[2]: Nothing to be done for `all'.
make[2]: Leaving directory `/home/Greg/make-3.82/config'
Making all in po
make[2]: Entering directory `/home/Greg/make-3.82/po'
make[2]: Nothing to be done for `all'.
make[2]: Leaving directory `/home/Greg/make-3.82/po'
Making all in doc
make[2]: Entering directory `/home/Greg/make-3.82/doc'
make[2]: Nothing to be done for `all'.
make[2]: Leaving directory `/home/Greg/make-3.82/doc'
make[2]: Entering directory `/home/Greg/make-3.82'
gcc -DLOCALEDIR=\"/usr/local/share/locale\" -DLIBDIR=\"/usr/local/lib\" -DINCLUDEDIR=\"/usr/local/include\" -DHAVE_CONFIG_H -I.  -I./glob   -I/usr/local/include   -MT ar.o -MD -MP -MF .deps/ar.Tpo -c -o ar.o ar.c
mv -f .deps/ar.Tpo .deps/ar.Po
gcc -DLOCALEDIR=\"/usr/local/share/locale\" -DLIBDIR=\"/usr/local/lib\" -DINCLUDEDIR=\"/usr/local/include\" -DHAVE_CONFIG_H -I.  -I./glob   -I/usr/local/include   -MT arscan.o -MD -MP -MF .deps/arscan.Tpo -c -o arscan.o arscan.c
mv -f .deps/arscan.Tpo .deps/arscan.Po
gcc -DLOCALEDIR=\"/usr/local/share/locale\" -DLIBDIR=\"/usr/local/lib\" -DINCLUDEDIR=\"/usr/local/include\" -DHAVE_CONFIG_H -I.  -I./glob   -I/usr/local/include   -MT commands.o -MD -MP -MF .deps/commands.Tpo -c -o commands.o commands.c
mv -f .deps/commands.Tpo .deps/commands.Po
gcc -DLOCALEDIR=\"/usr/local/share/locale\" -DLIBDIR=\"/usr/local/lib\" -DINCLUDEDIR=\"/usr/local/include\" -DHAVE_CONFIG_H -I.  -I./glob   -I/usr/local/include   -MT default.o -MD -MP -MF .deps/default.Tpo -c -o default.o default.c
mv -f .deps/default.Tpo .deps/default.Po
gcc -DLOCALEDIR=\"/usr/local/share/locale\" -DLIBDIR=\"/usr/local/lib\" -DINCLUDEDIR=\"/usr/local/include\" -DHAVE_CONFIG_H -I.  -I./glob   -I/usr/local/include   -MT dir.o -MD -MP -MF .deps/dir.Tpo -c -o dir.o dir.c
mv -f .deps/dir.Tpo .deps/dir.Po
gcc -DLOCALEDIR=\"/usr/local/share/locale\" -DLIBDIR=\"/usr/local/lib\" -DINCLUDEDIR=\"/usr/local/include\" -DHAVE_CONFIG_H -I.  -I./glob   -I/usr/local/include   -MT expand.o -MD -MP -MF .deps/expand.Tpo -c -o expand.o expand.c
mv -f .deps/expand.Tpo .deps/expand.Po
gcc -DLOCALEDIR=\"/usr/local/share/locale\" -DLIBDIR=\"/usr/local/lib\" -DINCLUDEDIR=\"/usr/local/include\" -DHAVE_CONFIG_H -I.  -I./glob   -I/usr/local/include   -MT file.o -MD -MP -MF .deps/file.Tpo -c -o file.o file.c
mv -f .deps/file.Tpo .deps/file.Po
gcc -DLOCALEDIR=\"/usr/local/share/locale\" -DLIBDIR=\"/usr/local/lib\" -DINCLUDEDIR=\"/usr/local/include\" -DHAVE_CONFIG_H -I.  -I./glob   -I/usr/local/include   -MT function.o -MD -MP -MF .deps/function.Tpo -c -o function.o function.c
mv -f .deps/function.Tpo .deps/function.Po
gcc -DLOCALEDIR=\"/usr/local/share/locale\" -DLIBDIR=\"/usr/local/lib\" -DINCLUDEDIR=\"/usr/local/include\" -DHAVE_CONFIG_H -I.  -I./glob   -I/usr/local/include   -MT getopt.o -MD -MP -MF .deps/getopt.Tpo -c -o getopt.o getopt.c
mv -f .deps/getopt.Tpo .deps/getopt.Po
gcc -DLOCALEDIR=\"/usr/local/share/locale\" -DLIBDIR=\"/usr/local/lib\" -DINCLUDEDIR=\"/usr/local/include\" -DHAVE_CONFIG_H -I.  -I./glob   -I/usr/local/include   -MT getopt1.o -MD -MP -MF .deps/getopt1.Tpo -c -o getopt1.o getopt1.c
mv -f .deps/getopt1.Tpo .deps/getopt1.Po
gcc -DLOCALEDIR=\"/usr/local/share/locale\" -DLIBDIR=\"/usr/local/lib\" -DINCLUDEDIR=\"/usr/local/include\" -DHAVE_CONFIG_H -I.  -I./glob   -I/usr/local/include   -MT implicit.o -MD -MP -MF .deps/implicit.Tpo -c -o implicit.o implicit.c
mv -f .deps/implicit.Tpo .deps/implicit.Po
gcc -DLOCALEDIR=\"/usr/local/share/locale\" -DLIBDIR=\"/usr/local/lib\" -DINCLUDEDIR=\"/usr/local/include\" -DHAVE_CONFIG_H -I.  -I./glob   -I/usr/local/include   -MT job.o -MD -MP -MF .deps/job.Tpo -c -o job.o job.c
mv -f .deps/job.Tpo .deps/job.Po
gcc -DLOCALEDIR=\"/usr/local/share/locale\" -DLIBDIR=\"/usr/local/lib\" -DINCLUDEDIR=\"/usr/local/include\" -DHAVE_CONFIG_H -I.  -I./glob   -I/usr/local/include   -MT main.o -MD -MP -MF .deps/main.Tpo -c -o main.o main.c
mv -f .deps/main.Tpo .deps/main.Po
gcc -DLOCALEDIR=\"/usr/local/share/locale\" -DLIBDIR=\"/usr/local/lib\" -DINCLUDEDIR=\"/usr/local/include\" -DHAVE_CONFIG_H -I.  -I./glob   -I/usr/local/include   -MT misc.o -MD -MP -MF .deps/misc.Tpo -c -o misc.o misc.c
mv -f .deps/misc.Tpo .deps/misc.Po
gcc -DLOCALEDIR=\"/usr/local/share/locale\" -DLIBDIR=\"/usr/local/lib\" -DINCLUDEDIR=\"/usr/local/include\" -DHAVE_CONFIG_H -I.  -I./glob   -I/usr/local/include   -MT read.o -MD -MP -MF .deps/read.Tpo -c -o read.o read.c
mv -f .deps/read.Tpo .deps/read.Po
gcc -DLOCALEDIR=\"/usr/local/share/locale\" -DLIBDIR=\"/usr/local/lib\" -DINCLUDEDIR=\"/usr/local/include\" -DHAVE_CONFIG_H -I.  -I./glob   -I/usr/local/include   -MT remake.o -MD -MP -MF .deps/remake.Tpo -c -o remake.o remake.c
mv -f .deps/remake.Tpo .deps/remake.Po
gcc -DLOCALEDIR=\"/usr/local/share/locale\" -DLIBDIR=\"/usr/local/lib\" -DINCLUDEDIR=\"/usr/local/include\" -DHAVE_CONFIG_H -I.  -I./glob   -I/usr/local/include   -MT remote-stub.o -MD -MP -MF .deps/remote-stub.Tpo -c -o remote-stub.o remote-stub.c
mv -f .deps/remote-stub.Tpo .deps/remote-stub.Po
gcc -DLOCALEDIR=\"/usr/local/share/locale\" -DLIBDIR=\"/usr/local/lib\" -DINCLUDEDIR=\"/usr/local/include\" -DHAVE_CONFIG_H -I.  -I./glob   -I/usr/local/include   -MT rule.o -MD -MP -MF .deps/rule.Tpo -c -o rule.o rule.c
mv -f .deps/rule.Tpo .deps/rule.Po
gcc -DLOCALEDIR=\"/usr/local/share/locale\" -DLIBDIR=\"/usr/local/lib\" -DINCLUDEDIR=\"/usr/local/include\" -DHAVE_CONFIG_H -I.  -I./glob   -I/usr/local/include   -MT signame.o -MD -MP -MF .deps/signame.Tpo -c -o signame.o signame.c
mv -f .deps/signame.Tpo .deps/signame.Po
gcc -DLOCALEDIR=\"/usr/local/share/locale\" -DLIBDIR=\"/usr/local/lib\" -DINCLUDEDIR=\"/usr/local/include\" -DHAVE_CONFIG_H -I.  -I./glob   -I/usr/local/include   -MT strcache.o -MD -MP -MF .deps/strcache.Tpo -c -o strcache.o strcache.c
mv -f .deps/strcache.Tpo .deps/strcache.Po
gcc -DLOCALEDIR=\"/usr/local/share/locale\" -DLIBDIR=\"/usr/local/lib\" -DINCLUDEDIR=\"/usr/local/include\" -DHAVE_CONFIG_H -I.  -I./glob   -I/usr/local/include   -MT variable.o -MD -MP -MF .deps/variable.Tpo -c -o variable.o variable.c
mv -f .deps/variable.Tpo .deps/variable.Po
gcc -DLOCALEDIR=\"/usr/local/share/locale\" -DLIBDIR=\"/usr/local/lib\" -DINCLUDEDIR=\"/usr/local/include\" -DHAVE_CONFIG_H -I.  -I./glob   -I/usr/local/include   -MT version.o -MD -MP -MF .deps/version.Tpo -c -o version.o version.c
mv -f .deps/version.Tpo .deps/version.Po
gcc -DLOCALEDIR=\"/usr/local/share/locale\" -DLIBDIR=\"/usr/local/lib\" -DINCLUDEDIR=\"/usr/local/include\" -DHAVE_CONFIG_H -I.  -I./glob   -I/usr/local/include   -MT vpath.o -MD -MP -MF .deps/vpath.Tpo -c -o vpath.o vpath.c
mv -f .deps/vpath.Tpo .deps/vpath.Po
gcc -DLOCALEDIR=\"/usr/local/share/locale\" -DLIBDIR=\"/usr/local/lib\" -DINCLUDEDIR=\"/usr/local/include\" -DHAVE_CONFIG_H -I.  -I./glob   -I/usr/local/include   -MT hash.o -MD -MP -MF .deps/hash.Tpo -c -o hash.o hash.c
mv -f .deps/hash.Tpo .deps/hash.Po
gcc -DLOCALEDIR=\"/usr/local/share/locale\" -DLIBDIR=\"/usr/local/lib\" -DINCLUDEDIR=\"/usr/local/include\" -DHAVE_CONFIG_H -I.  -I./glob   -I/usr/local/include   -MT getloadavg.o -MD -MP -MF .deps/getloadavg.Tpo -c -o getloadavg.o getloadavg.c
mv -f .deps/getloadavg.Tpo .deps/getloadavg.Po
gcc     -o make.exe ar.o arscan.o commands.o  default.o dir.o expand.o  file.o function.o getopt.o  getopt1.o implicit.o job.o  main.o misc.o read.o remake.o  remote-stub.o rule.o signame.o  strcache.o variable.o version.o  vpath.o hash.o getloadavg.o  glob/libglob.a  -lintl   
make[2]: Leaving directory `/home/Greg/make-3.82'
make[1]: Leaving directory `/home/Greg/make-3.82'

+++++++++++++++++++++++
Executing "make check"
+++++++++++++++++++++++
Making check in glob
make[1]: Entering directory `/home/Greg/make-3.82/glob'
make[1]: Nothing to be done for `check'.
make[1]: Leaving directory `/home/Greg/make-3.82/glob'
Making check in config
make[1]: Entering directory `/home/Greg/make-3.82/config'
make[1]: Nothing to be done for `check'.
make[1]: Leaving directory `/home/Greg/make-3.82/config'
Making check in po
make[1]: Entering directory `/home/Greg/make-3.82/po'
make[1]: Nothing to be done for `check'.
make[1]: Leaving directory `/home/Greg/make-3.82/po'
Making check in doc
make[1]: Entering directory `/home/Greg/make-3.82/doc'
make[1]: Nothing to be done for `check'.
make[1]: Leaving directory `/home/Greg/make-3.82/doc'
make[1]: Entering directory `/home/Greg/make-3.82'
make  loadavg.exe
make[2]: Entering directory `/home/Greg/make-3.82'
gcc -DLOCALEDIR=\"/usr/local/share/locale\" -DLIBDIR=\"/usr/local/lib\" -DINCLUDEDIR=\"/usr/local/include\" -DHAVE_CONFIG_H -I.  -DTEST -I/usr/local/include   -MT loadavg-getloadavg.o -MD -MP -MF .deps/loadavg-getloadavg.Tpo -c -o loadavg-getloadavg.o `test -f 'getloadavg.c' || echo './'`getloadavg.c
mv -f .deps/loadavg-getloadavg.Tpo .deps/loadavg-getloadavg.Po
gcc     -o loadavg.exe loadavg-getloadavg.o  
make[2]: Leaving directory `/home/Greg/make-3.82'
make  check-local
make[2]: Entering directory `/home/Greg/make-3.82'
cd tests && perl ./run_make_tests.pl -make ../make.exe 
------------------------------------------------------------------------------
Running tests for GNU make on CYGWIN_NT-6.2 BabyPlatypus 1.7.21(0.267/5/3) x86_64
                                GNU Make 3.82
------------------------------------------------------------------------------

Clearing work...
Finding tests...

features/comments ....................................... ok     (1 passed)
features/conditionals ................................... ok     (4 passed)
features/default_names .................................. ok     (2 passed)
features/double_colon ................................... FAILED (7/10 passed)
features/echoing ........................................ ok     (4 passed)
features/errors ......................................... ok     (2 passed)
features/escape ......................................... FAILED (1/6 passed)
features/export ......................................... FAILED (0/12 passed)
features/include ........................................ FAILED (9/10 passed)
features/mult_rules ..................................... ok     (2 passed)
features/mult_targets ................................... ok     (2 passed)
features/order_only ..................................... ok     (10 passed)
features/override ....................................... FAILED (1/4 passed)
features/parallelism .................................... FAILED (0/8 passed)
features/patspecific_vars ............................... FAILED (6/10 passed)
features/patternrules ................................... FAILED (5/10 passed)
features/quoting ........................................ FAILED (0/1 passed)
features/recursion ...................................... FAILED (0/2 passed)
features/reinvoke ....................................... FAILED (0/4 passed)
features/se_explicit .................................... ok     (9 passed)
features/se_implicit .................................... ok     (9 passed)
features/se_statpat ..................................... ok     (4 passed)
features/statipattrules ................................. ok     (8 passed)
features/targetvars ..................................... FAILED (15/23 passed)
features/varnesting ..................................... ok     (1 passed)
features/vpath .......................................... ok     (2 passed)
features/vpath2 ......................................... ok     (1 passed)
features/vpath3 ......................................... ok     (1 passed)
features/vpathgpath ..................................... ok     (1 passed)
features/vpathplus ...................................... FAILED (0/4 passed)
functions/abspath ....................................... FAILED (0/1 passed)
functions/addprefix ..................................... ok     (1 passed)
functions/addsuffix ..................................... ok     (2 passed)
functions/andor ......................................... ok     (2 passed)
functions/basename ...................................... ok     (1 passed)
functions/call .......................................... FAILED (1/2 passed)
functions/dir ........................................... ok     (1 passed)
functions/error ......................................... ok     (5 passed)
functions/eval .......................................... FAILED (8/9 passed)
functions/filter-out .................................... ok     (1 passed)
functions/findstring .................................... ok     (1 passed)
functions/flavor ........................................ ok     (1 passed)
functions/foreach ....................................... FAILED (3/4 passed)
functions/if ............................................ ok     (1 passed)
functions/join .......................................... ok     (1 passed)
functions/notdir ........................................ ok     (1 passed)
functions/origin ........................................ ok     (1 passed)
functions/realpath ...................................... Error running ../make (expected 0; got 512): ../make -f work/functions/realpath.mk
FAILED (0/1 passed)
functions/shell ......................................... FAILED (1/2 passed)
functions/sort .......................................... ok     (1 passed)
functions/strip ......................................... ok     (2 passed)
functions/substitution .................................. FAILED (2/3 passed)
functions/suffix ........................................ ok     (1 passed)
functions/value ......................................... FAILED (0/1 passed)
functions/warning ....................................... ok     (4 passed)
functions/wildcard ...................................... ok     (4 passed)
functions/word .......................................... FAILED (14/16 passed)
misc/close_stdout ....................................... FAILED (0/1 passed)
misc/general1 ........................................... ok     (1 passed)
misc/general2 ........................................... ok     (1 passed)
misc/general3 ........................................... FAILED (5/10 passed)
misc/general4 ........................................... FAILED (5/6 passed)
options/dash-B .......................................... FAILED (5/8 passed)
options/dash-C .......................................... ok     (2 passed)
options/dash-I .......................................... ok     (2 passed)
options/dash-W .......................................... FAILED (5/10 passed)
options/dash-e .......................................... FAILED (0/1 passed)
options/dash-f .......................................... ok     (4 passed)
options/dash-k .......................................... FAILED (2/3 passed)
options/dash-l .......................................... ok     (0 passed)
options/dash-n .......................................... FAILED (3/4 passed)
options/dash-q .......................................... ok     (8 passed)
options/dash-t .......................................... ok     (2 passed)
options/eval ............................................ FAILED (0/2 passed)
options/general ......................................... FAILED (0/1 passed)
options/symlinks ........................................ N/A
options/warn-undefined-variables ........................ ok     (2 passed)
targets/DEFAULT ......................................... ok     (1 passed)
targets/FORCE ........................................... ok     (1 passed)
targets/INTERMEDIATE .................................... FAILED (6/8 passed)
targets/ONESHELL ........................................ FAILED (1/5 passed)
targets/PHONY ........................................... ok     (1 passed)
targets/POSIX ........................................... FAILED (1/2 passed)
targets/SECONDARY ....................................... ok     (12 passed)
targets/SILENT .......................................... ok     (1 passed)
targets/clean ........................................... ok     (2 passed)
variables/CURDIR ........................................ ok     (1 passed)
variables/DEFAULT_GOAL .................................. ok     (5 passed)
variables/INCLUDE_DIRS .................................. ok     (2 passed)
variables/LIBPATTERNS ................................... FAILED (0/2 passed)
variables/MAKE .......................................... FAILED (0/1 passed)
variables/MAKECMDGOALS .................................. ok     (3 passed)
variables/MAKEFILES ..................................... FAILED (1/2 passed)
variables/MAKEFLAGS ..................................... ok     (2 passed)
variables/MAKELEVEL ..................................... FAILED (0/1 passed)
variables/MAKE_RESTARTS ................................. FAILED (1/3 passed)
variables/MFILE_LIST .................................... ok     (1 passed)
variables/SHELL ......................................... FAILED (2/7 passed)
variables/automatic ..................................... FAILED (6/7 passed)
variables/define ........................................ ok     (15 passed)
variables/flavors ....................................... ok     (6 passed)
variables/negative ...................................... FAILED (2/4 passed)
variables/private ....................................... FAILED (6/8 passed)
variables/special ....................................... FAILED (1/2 passed)
variables/undefine ...................................... ok     (4 passed)

117 Tests in 46 Categories Failed (See .diff files in work dir for details) :-(

Makefile:1100: recipe for target `check-regression' failed
make[2]: Leaving directory `/home/Greg/make-3.82'
Makefile:919: recipe for target `check-am' failed
make[1]: Leaving directory `/home/Greg/make-3.82'
Makefile:593: recipe for target `check-recursive' failed

+++++++++++++++++++++++
Executing "trap - DEBUG"
+++++++++++++++++++++++

+++++++++++
Contents of failed tests:

Contents of ./tests/work/features/double_colon.diff.2:
*** work/features/double_colon.base.2	Mon Jul  8 20:58:30 2013
--- work/features/double_colon.log.2	Mon Jul  8 20:58:30 2013
***************
*** 1,3 ****
--- 1,5 ----
+ shell-init: error retrieving current directory: getcwd: cannot access parent directories: No error
  aaa
+ job-working-directory: error retrieving current directory: getcwd: cannot access parent directories: No such file or directory
  aaa done
  bbb

Contents of ./tests/work/features/double_colon.diff.3:
*** work/features/double_colon.base.3	Mon Jul  8 20:58:31 2013
--- work/features/double_colon.log.3	Mon Jul  8 20:58:31 2013
***************
*** 1,3 ****
--- 1,5 ----
+ shell-init: error retrieving current directory: getcwd: cannot access parent directories: No error
  aaa
+ job-working-directory: error retrieving current directory: getcwd: cannot access parent directories: No such file or directory
  aaa done
  bbb

Contents of ./tests/work/features/double_colon.diff.9:
*** work/features/double_colon.base.9	Mon Jul  8 20:58:31 2013
--- work/features/double_colon.log.9	Mon Jul  8 20:58:31 2013
***************
*** 1,2 ****
--- 1,4 ----
+ shell-init: error retrieving current directory: getcwd: cannot access parent directories: No error
  one
+ shell-init: error retrieving current directory: getcwd: cannot access parent directories: No error
  two

Contents of ./tests/work/features/escape.diff.2:
*** work/features/escape.base.2	Mon Jul  8 20:58:31 2013
--- work/features/escape.log.2	Mon Jul  8 20:58:31 2013
***************
*** 1 ****
--- 1,3 ----
+ shell-init: error retrieving current directory: getcwd: cannot access parent directories: No error
+ shell-init: error retrieving current directory: getcwd: cannot access parent directories: No error
  touch (pre:foo)

Contents of ./tests/work/features/escape.diff.3:
*** work/features/escape.base.3	Mon Jul  8 20:58:31 2013
--- work/features/escape.log.3	Mon Jul  8 20:58:31 2013
***************
*** 1 ****
--- 1,2 ----
+ shell-init: error retrieving current directory: getcwd: cannot access parent directories: No error
  work/features/escape.mk:2: *** target pattern contains no `%'.  Stop.

Contents of ./tests/work/features/escape.diff.4:
*** work/features/escape.base.4	Mon Jul  8 20:58:31 2013
--- work/features/escape.log.4	Mon Jul  8 20:58:31 2013
***************
*** 1 ****
--- 1,3 ----
+ shell-init: error retrieving current directory: getcwd: cannot access parent directories: No error
+ shell-init: error retrieving current directory: getcwd: cannot access parent directories: No error
  touch (foo bar)

Contents of ./tests/work/features/escape.diff.5:
*** work/features/escape.base.5	Mon Jul  8 20:58:31 2013
--- work/features/escape.log.5	Mon Jul  8 20:58:31 2013
***************
*** 1 ****
--- 1,2 ----
+ shell-init: error retrieving current directory: getcwd: cannot access parent directories: No error
  foo#bar.ext = (foo#bar.ext)

Contents of ./tests/work/features/export.diff.1:
*** work/features/export.base.1	Mon Jul  8 20:58:32 2013
--- work/features/export.log.1	Mon Jul  8 20:58:32 2013
***************
*** 1,2 ****
--- 1,4 ----
+ shell-init: error retrieving current directory: getcwd: cannot access parent directories: No error
  FOO=foo BAR=bar BAZ=baz BOZ=boz BITZ=bitz BOTZ=botz
+ shell-init: error retrieving current directory: getcwd: cannot access parent directories: No error
  FOO=foo BAR= BAZ=baz BOZ=boz BITZ=bitz BOTZ=

Contents of ./tests/work/features/export.diff.10:
*** work/features/export.base.10	Mon Jul  8 20:58:32 2013
--- work/features/export.log.10	Mon Jul  8 20:58:32 2013
***************
*** 1 ****
--- 1,2 ----
+ shell-init: error retrieving current directory: getcwd: cannot access parent directories: No error
  $(export)=456 / $export=456

Contents of ./tests/work/features/export.diff.11:
*** work/features/export.base.11	Mon Jul  8 20:58:32 2013
--- work/features/export.log.11	Mon Jul  8 20:58:32 2013
***************
*** 1 ****
--- 1,2 ----
+ shell-init: error retrieving current directory: getcwd: cannot access parent directories: No error
  export

Contents of ./tests/work/features/export.diff.2:
*** work/features/export.base.2	Mon Jul  8 20:58:32 2013
--- work/features/export.log.2	Mon Jul  8 20:58:32 2013
***************
*** 1,2 ****
--- 1,4 ----
+ shell-init: error retrieving current directory: getcwd: cannot access parent directories: No error
  FOO=foo BAR=bar BAZ=baz BOZ=boz BITZ=bitz BOTZ=botz
+ shell-init: error retrieving current directory: getcwd: cannot access parent directories: No error
  FOO=foo BAR=bar BAZ=baz BOZ=boz BITZ=bitz BOTZ=

Contents of ./tests/work/features/export.diff.3:
*** work/features/export.base.3	Mon Jul  8 20:58:32 2013
--- work/features/export.log.3	Mon Jul  8 20:58:32 2013
***************
*** 1,2 ****
--- 1,4 ----
+ shell-init: error retrieving current directory: getcwd: cannot access parent directories: No error
  FOO=foo BAR=bar BAZ=baz BOZ=boz BITZ=bitz BOTZ=botz
+ shell-init: error retrieving current directory: getcwd: cannot access parent directories: No error
  FOO= BAR= BAZ=baz BOZ=boz BITZ=bitz BOTZ=

Contents of ./tests/work/features/export.diff.4:
*** work/features/export.base.4	Mon Jul  8 20:58:32 2013
--- work/features/export.log.4	Mon Jul  8 20:58:32 2013
***************
*** 1,2 ****
--- 1,4 ----
+ shell-init: error retrieving current directory: getcwd: cannot access parent directories: No error
  FOO=foo BAR=bar BAZ=baz BOZ=boz BITZ=bitz BOTZ=botz
+ shell-init: error retrieving current directory: getcwd: cannot access parent directories: No error
  FOO= BAR= BAZ=baz BOZ=boz BITZ=bitz BOTZ=

Contents of ./tests/work/features/export.diff.5:
*** work/features/export.base.5	Mon Jul  8 20:58:32 2013
--- work/features/export.log.5	Mon Jul  8 20:58:32 2013
***************
*** 1,2 ****
--- 1,4 ----
+ shell-init: error retrieving current directory: getcwd: cannot access parent directories: No error
  FOO=foo BAR=bar BAZ=baz BOZ=boz BITZ=bitz BOTZ=botz
+ shell-init: error retrieving current directory: getcwd: cannot access parent directories: No error
  FOO=foo BAR=bar BAZ=baz BOZ=boz BITZ=bitz BOTZ=

Contents of ./tests/work/features/export.diff.6:
*** work/features/export.base.6	Mon Jul  8 20:58:32 2013
--- work/features/export.log.6	Mon Jul  8 20:58:32 2013
***************
*** 1,2 ****
--- 1,3 ----
  foo=f-ok bar=b-ok
+ shell-init: error retrieving current directory: getcwd: cannot access parent directories: No error
  foo=f-ok bar=b-ok

Contents of ./tests/work/features/export.diff.7:
*** work/features/export.base.7	Mon Jul  8 20:58:32 2013
--- work/features/export.log.7	Mon Jul  8 20:58:32 2013
***************
*** 1,2 ****
--- 1,3 ----
  foo=f-ok bar=b-ok
+ shell-init: error retrieving current directory: getcwd: cannot access parent directories: No error
  foo= bar=

Contents of ./tests/work/features/export.diff.8:
*** work/features/export.base.8	Mon Jul  8 20:58:32 2013
--- work/features/export.log.8	Mon Jul  8 20:58:32 2013
***************
*** 1 ****
--- 1,2 ----
+ shell-init: error retrieving current directory: getcwd: cannot access parent directories: No error
  A=a B=b C=c D=d E=e F=f G=g H=h I=i J=j

Contents of ./tests/work/features/export.diff.9:
*** work/features/export.base.9	Mon Jul  8 20:58:32 2013
--- work/features/export.log.9	Mon Jul  8 20:58:32 2013
***************
*** 1 ****
--- 1,2 ----
+ shell-init: error retrieving current directory: getcwd: cannot access parent directories: No error
  A= B= C= D= E= F= G= H= I= J=

Contents of ./tests/work/features/include.diff.5:
*** work/features/include.base.5	Mon Jul  8 20:58:32 2013
--- work/features/include.log.5	Mon Jul  8 20:58:32 2013
***************
*** 0 ****
--- 1 ----
+ shell-init: error retrieving current directory: getcwd: cannot access parent directories: No error

Contents of ./tests/work/features/override.diff.1:
*** work/features/override.base.1	Mon Jul  8 20:58:33 2013
--- work/features/override.log.1	Mon Jul  8 20:58:33 2013
***************
*** 1 ****
--- 1,2 ----
+ shell-init: error retrieving current directory: getcwd: cannot access parent directories: No error
  X1 X2 Y1

Contents of ./tests/work/features/override.diff.2:
*** work/features/override.base.2	Mon Jul  8 20:58:33 2013
--- work/features/override.log.2	Mon Jul  8 20:58:33 2013
***************
*** 1 ****
--- 1,2 ----
+ shell-init: error retrieving current directory: getcwd: cannot access parent directories: No error
  C X2 C Y1

Contents of ./tests/work/features/parallelism.diff.1:
*** work/features/parallelism.base.1	Mon Jul  8 20:58:40 2013
--- work/features/parallelism.log.1	Mon Jul  8 20:58:40 2013
***************
*** 1,7 ****
--- 1,15 ----
+ shell-init: error retrieving current directory: getcwd: cannot access parent directories: No error
+ shell-init: error retrieving current directory: getcwd: cannot access parent directories: No error
  ONE.inc
+ job-working-directory: error retrieving current directory: getcwd: cannot access parent directories: No such file or directory
+ job-working-directory: error retrieving current directory: getcwd: cannot access parent directories: No such file or directory
  THREE.inc
  TWO.inc
+ shell-init: error retrieving current directory: getcwd: cannot access parent directories: No error
  ONE
+ shell-init: error retrieving current directory: getcwd: cannot access parent directories: No error
+ job-working-directory: error retrieving current directory: getcwd: cannot access parent directories: No such file or directory
+ job-working-directory: error retrieving current directory: getcwd: cannot access parent directories: No such file or directory
  THREE
  TWO
  success

Contents of ./tests/work/features/parallelism.diff.2:
*** work/features/parallelism.base.2	Mon Jul  8 20:58:45 2013
--- work/features/parallelism.log.2	Mon Jul  8 20:58:45 2013
***************
*** 1,7 ****
--- 1,15 ----
+ shell-init: error retrieving current directory: getcwd: cannot access parent directories: No error
+ shell-init: error retrieving current directory: getcwd: cannot access parent directories: No error
  ONE.inc
+ job-working-directory: error retrieving current directory: getcwd: cannot access parent directories: No such file or directory
+ job-working-directory: error retrieving current directory: getcwd: cannot access parent directories: No such file or directory
  THREE.inc
  TWO.inc
+ shell-init: error retrieving current directory: getcwd: cannot access parent directories: No error
  ONE
+ shell-init: error retrieving current directory: getcwd: cannot access parent directories: No error
+ job-working-directory: error retrieving current directory: getcwd: cannot access parent directories: No such file or directory
+ job-working-directory: error retrieving current directory: getcwd: cannot access parent directories: No such file or directory
  THREE
  TWO
  success

Contents of ./tests/work/features/parallelism.diff.3:
*** work/features/parallelism.base.3	Mon Jul  8 20:58:50 2013
--- work/features/parallelism.log.3	Mon Jul  8 20:58:50 2013
***************
*** 1,4 ****
--- 1,10 ----
+ shell-init: error retrieving current directory: getcwd: cannot access parent directories: No error
  first
+ shell-init: error retrieving current directory: getcwd: cannot access parent directories: No error
+ job-working-directory: error retrieving current directory: getcwd: cannot access parent directories: No such file or directory
+ job-working-directory: error retrieving current directory: getcwd: cannot access parent directories: No such file or directory
  first
+ shell-init: error retrieving current directory: getcwd: cannot access parent directories: No error
  second
+ job-working-directory: error retrieving current directory: getcwd: cannot access parent directories: No such file or directory
  second

Contents of ./tests/work/features/parallelism.diff.4:
*** work/features/parallelism.base.4	Mon Jul  8 20:58:54 2013
--- work/features/parallelism.log.4	Mon Jul  8 20:58:54 2013
***************
*** 1,8 ****
--- 1,11 ----
  Fail
+ shell-init: error retrieving current directory: getcwd: cannot access parent directories: No error
  make: *** [fail.1] Error 1
  make: *** Waiting for unfinished jobs....
  Fail
+ shell-init: error retrieving current directory: getcwd: cannot access parent directories: No error
  make: *** [fail.2] Error 1
  Fail
+ shell-init: error retrieving current directory: getcwd: cannot access parent directories: No error
  make: *** [fail.3] Error 1
  Ok done

Contents of ./tests/work/features/parallelism.diff.5:
*** work/features/parallelism.base.5	Mon Jul  8 20:58:54 2013
--- work/features/parallelism.log.5	Mon Jul  8 20:58:54 2013
***************
*** 0 ****
--- 1,2 ----
+ shell-init: error retrieving current directory: getcwd: cannot access parent directories: No error
+ shell-init: error retrieving current directory: getcwd: cannot access parent directories: No error

Contents of ./tests/work/features/parallelism.diff.6:
*** work/features/parallelism.base.6	Mon Jul  8 20:58:54 2013
--- work/features/parallelism.log.6	Mon Jul  8 20:58:54 2013
***************
*** 1 ****
--- 1,2 ----
  : phony
+ shell-init: error retrieving current directory: getcwd: cannot access parent directories: No error

Contents of ./tests/work/features/parallelism.diff.7:
*** work/features/parallelism.base.7	Mon Jul  8 20:58:54 2013
--- work/features/parallelism.log.7	Mon Jul  8 20:58:54 2013
***************
*** 1,2 ****
--- 1,4 ----
+ shell-init: error retrieving current directory: getcwd: cannot access parent directories: No error
  make[1]: warning: -jN forced in submake: disabling jobserver mode.
+ shell-init: error retrieving current directory: getcwd: cannot access parent directories: No error
  all

Contents of ./tests/work/features/patspecific_vars.diff.3:
*** work/features/patspecific_vars.base.3	Mon Jul  8 20:58:54 2013
--- work/features/patspecific_vars.log.3	Mon Jul  8 20:58:54 2013
***************
*** 1,2 ****
--- 1,3 ----
+ shell-init: error retrieving current directory: getcwd: cannot access parent directories: No error
  aaa bbb
  ccc ddd

Contents of ./tests/work/features/patspecific_vars.diff.4:
*** work/features/patspecific_vars.base.4	Mon Jul  8 20:58:56 2013
--- work/features/patspecific_vars.log.4	Mon Jul  8 20:58:56 2013
***************
*** 1 ****
--- 1,2 ----
+ shell-init: error retrieving current directory: getcwd: cannot access parent directories: No error
  foo foo

Contents of ./tests/work/features/patspecific_vars.diff.7:
*** work/features/patspecific_vars.base.7	Mon Jul  8 20:58:57 2013
--- work/features/patspecific_vars.log.7	Mon Jul  8 20:58:57 2013
***************
*** 1 ****
--- 1,2 ----
+ shell-init: error retrieving current directory: getcwd: cannot access parent directories: No error
  f1

Contents of ./tests/work/features/patspecific_vars.diff.8:
*** work/features/patspecific_vars.base.8	Mon Jul  8 20:58:57 2013
--- work/features/patspecific_vars.log.8	Mon Jul  8 20:58:57 2013
***************
*** 1 ****
--- 1,2 ----
+ shell-init: error retrieving current directory: getcwd: cannot access parent directories: No error
  C f1

Contents of ./tests/work/features/patternrules.diff.3:
*** work/features/patternrules.base.3	Mon Jul  8 20:58:57 2013
--- work/features/patternrules.log.3	Mon Jul  8 20:58:57 2013
***************
*** 1 ****
--- 1,3 ----
+ shell-init: error retrieving current directory: getcwd: cannot access parent directories: No error
+ job-working-directory: error retrieving current directory: getcwd: cannot access parent directories: No such file or directory
  make: *** [../tests/foo.bar] Error 1

Contents of ./tests/work/features/patternrules.diff.4:
*** work/features/patternrules.base.4	Mon Jul  8 20:58:57 2013
--- work/features/patternrules.log.4	Mon Jul  8 20:58:57 2013
***************
*** 2,4 ****
--- 2,5 ----
  touch foo.h
  touch foo.c
  echo foo.c foo.h >foo.o
+ shell-init: error retrieving current directory: getcwd: cannot access parent directories: No error

Contents of ./tests/work/features/patternrules.diff.6:
*** work/features/patternrules.base.6	Mon Jul  8 20:58:57 2013
--- work/features/patternrules.log.6	Mon Jul  8 20:58:57 2013
***************
*** 1 ****
--- 1,2 ----
+ shell-init: error retrieving current directory: getcwd: cannot access parent directories: No error
  ok

Contents of ./tests/work/features/patternrules.diff.7:
*** work/features/patternrules.base.7	Mon Jul  8 20:58:57 2013
--- work/features/patternrules.log.7	Mon Jul  8 20:58:57 2013
***************
*** 1,4 ****
--- 1,5 ----
  dep
+ shell-init: error retrieving current directory: getcwd: cannot access parent directories: No error
  x.t1
  x.t2
  x

Contents of ./tests/work/features/recursion.diff.1:
*** work/features/recursion.base.1	Mon Jul  8 20:58:57 2013
--- work/features/recursion.log.1	Mon Jul  8 20:58:57 2013
***************
*** 1,2 ****
--- 1,4 ----
+ shell-init: error retrieving current directory: getcwd: cannot access parent directories: No error
  MAKEOVERRIDES = a=ZZ
+ shell-init: error retrieving current directory: getcwd: cannot access parent directories: No error
  MAKEOVERRIDES = a=AA

Contents of ./tests/work/features/reinvoke.diff.1:
*** work/features/reinvoke.base.1	Mon Jul  8 20:58:58 2013
--- work/features/reinvoke.log.1	Mon Jul  8 20:58:58 2013
***************
*** 1,2 ****
--- 1,3 ----
  rebuilding work/features/reinvoke.mk
+ shell-init: error retrieving current directory: getcwd: cannot access parent directories: No error
  running rules.

Contents of ./tests/work/features/reinvoke.diff.2:
*** work/features/reinvoke.base.2	Mon Jul  8 20:58:58 2013
--- work/features/reinvoke.log.2	Mon Jul  8 20:58:58 2013
***************
*** 1,2 ****
--- 1,3 ----
  [ -f b ] || echo >> b
+ shell-init: error retrieving current directory: getcwd: cannot access parent directories: No error
  hello

Contents of ./tests/work/features/reinvoke.diff.3:
*** work/features/reinvoke.base.3	Mon Jul  8 20:58:58 2013
--- work/features/reinvoke.log.3	Mon Jul  8 20:58:58 2013
***************
*** 1,2 ****
--- 1,3 ----
  [ -f b ] || echo >> b
+ shell-init: error retrieving current directory: getcwd: cannot access parent directories: No error
  hello

Contents of ./tests/work/features/targetvars.diff.12:
*** work/features/targetvars.base.12	Mon Jul  8 20:59:00 2013
--- work/features/targetvars.log.12	Mon Jul  8 20:59:00 2013
***************
*** 1 ****
--- 1,2 ----
+ shell-init: error retrieving current directory: getcwd: cannot access parent directories: No error
  ; ok

Contents of ./tests/work/features/targetvars.diff.17:
*** work/features/targetvars.base.17	Mon Jul  8 20:59:00 2013
--- work/features/targetvars.log.17	Mon Jul  8 20:59:00 2013
***************
*** 1 ****
--- 1,2 ----
+ shell-init: error retrieving current directory: getcwd: cannot access parent directories: No error
  no build information

Contents of ./tests/work/features/targetvars.diff.2:
*** work/features/targetvars.base.2	Mon Jul  8 20:58:59 2013
--- work/features/targetvars.log.2	Mon Jul  8 20:58:59 2013
***************
*** 1 ****
--- 1,2 ----
+ shell-init: error retrieving current directory: getcwd: cannot access parent directories: No error
  x ok  ok

Contents of ./tests/work/features/targetvars.diff.20:
*** work/features/targetvars.base.20	Mon Jul  8 20:59:00 2013
--- work/features/targetvars.log.20	Mon Jul  8 20:59:00 2013
***************
*** 1 ****
--- 1,2 ----
+ shell-init: error retrieving current directory: getcwd: cannot access parent directories: No error
  f1

Contents of ./tests/work/features/targetvars.diff.21:
*** work/features/targetvars.base.21	Mon Jul  8 20:59:00 2013
--- work/features/targetvars.log.21	Mon Jul  8 20:59:00 2013
***************
*** 1 ****
--- 1,2 ----
+ shell-init: error retrieving current directory: getcwd: cannot access parent directories: No error
  C f1

Contents of ./tests/work/features/targetvars.diff.4:
*** work/features/targetvars.base.4	Mon Jul  8 20:59:00 2013
--- work/features/targetvars.log.4	Mon Jul  8 20:59:00 2013
***************
*** 1 ****
--- 1,2 ----
+ shell-init: error retrieving current directory: getcwd: cannot access parent directories: No error
  wallace bar wallace bar

Contents of ./tests/work/features/targetvars.diff.5:
*** work/features/targetvars.base.5	Mon Jul  8 20:59:00 2013
--- work/features/targetvars.log.5	Mon Jul  8 20:59:00 2013
***************
*** 1 ****
--- 1,2 ----
+ shell-init: error retrieving current directory: getcwd: cannot access parent directories: No error
  baz

Contents of ./tests/work/features/vpathplus.diff.1:
*** work/features/vpathplus.base.1	Mon Jul  8 20:59:01 2013
--- work/features/vpathplus.log.1	Mon Jul  8 20:59:01 2013
***************
*** 1,3 ****
--- 1,6 ----
+ shell-init: error retrieving current directory: getcwd: cannot access parent directories: No error
  not creating notarget.c from notarget.d
  cat notarget.c > notarget.b 2>/dev/null || exit 1
+ shell-init: error retrieving current directory: getcwd: cannot access parent directories: No error
+ job-working-directory: error retrieving current directory: getcwd: cannot access parent directories: No such file or directory
  make: *** [notarget.b] Error 1

Contents of ./tests/work/features/vpathplus.diff.2:
*** work/features/vpathplus.base.2	Mon Jul  8 20:59:01 2013
--- work/features/vpathplus.log.2	Mon Jul  8 20:59:01 2013
***************
*** 1,4 ****
--- 1,10 ----
  cat work/inter.d > inter.c
+ shell-init: error retrieving current directory: getcwd: cannot access parent directories: No error
+ job-working-directory: error retrieving current directory: getcwd: cannot access parent directories: No such file or directory
  cat inter.c > inter.b 2>/dev/null || exit 1
+ shell-init: error retrieving current directory: getcwd: cannot access parent directories: No error
+ job-working-directory: error retrieving current directory: getcwd: cannot access parent directories: No such file or directory
  cat inter.b > inter.a
+ shell-init: error retrieving current directory: getcwd: cannot access parent directories: No error
+ job-working-directory: error retrieving current directory: getcwd: cannot access parent directories: No such file or directory
  rm inter.b inter.c

Contents of ./tests/work/features/vpathplus.diff.3:
*** work/features/vpathplus.base.3	Mon Jul  8 20:59:01 2013
--- work/features/vpathplus.log.3	Mon Jul  8 20:59:01 2013
***************
*** 1,4 ****
--- 1,10 ----
  cat work/inter.d > inter.c
+ shell-init: error retrieving current directory: getcwd: cannot access parent directories: No error
+ job-working-directory: error retrieving current directory: getcwd: cannot access parent directories: No such file or directory
  cat inter.c > inter.b 2>/dev/null || exit 1
+ shell-init: error retrieving current directory: getcwd: cannot access parent directories: No error
+ job-working-directory: error retrieving current directory: getcwd: cannot access parent directories: No such file or directory
  cat inter.b > inter.a
+ shell-init: error retrieving current directory: getcwd: cannot access parent directories: No error
+ job-working-directory: error retrieving current directory: getcwd: cannot access parent directories: No such file or directory
  rm inter.c

Contents of ./tests/work/functions/eval.diff.5:
*** work/functions/eval.base.5	Mon Jul  8 20:59:02 2013
--- work/functions/eval.log.5	Mon Jul  8 20:59:02 2013
***************
*** 1 ****
--- 1,2 ----
+ shell-init: error retrieving current directory: getcwd: cannot access parent directories: No error
  OK

Contents of ./tests/work/functions/foreach.diff.1:
*** work/functions/foreach.base.1	Mon Jul  8 20:59:02 2013
--- work/functions/foreach.log.1	Mon Jul  8 20:59:02 2013
***************
*** 1 ****
--- 1,2 ----
+ shell-init: error retrieving current directory: getcwd: cannot access parent directories: No error
  FOREACH

Contents of ./tests/work/functions/shell.diff.1:
*** work/functions/shell.base.1	Mon Jul  8 20:59:03 2013
--- work/functions/shell.log.1	Mon Jul  8 20:59:03 2013
***************
*** 1 ****
--- 1,2 ----
+ shell-init: error retrieving current directory: getcwd: cannot access parent directories: No error
  hi

Contents of ./tests/work/functions/word.diff.14:
*** work/functions/word.base.14	Mon Jul  8 20:59:04 2013
--- work/functions/word.log.14	Mon Jul  8 20:59:04 2013
***************
*** 1 ****
--- 1,2 ----
+ shell-init: error retrieving current directory: getcwd: cannot access parent directories: No error
  foo

Contents of ./tests/work/functions/word.diff.15:
*** work/functions/word.base.15	Mon Jul  8 20:59:04 2013
--- work/functions/word.log.15	Mon Jul  8 20:59:04 2013
***************
*** 1 ****
--- 1,2 ----
+ shell-init: error retrieving current directory: getcwd: cannot access parent directories: No error
  baz

Contents of ./tests/work/misc/general3.diff.5:
*** work/misc/general3.base.5	Mon Jul  8 20:59:04 2013
--- work/misc/general3.log.5	Mon Jul  8 20:59:04 2013
***************
*** 1,8 ****
--- 1,16 ----
+ shell-init: error retrieving current directory: getcwd: cannot access parent directories: No error
  foobar
+ shell-init: error retrieving current directory: getcwd: cannot access parent directories: No error
  foobar
+ shell-init: error retrieving current directory: getcwd: cannot access parent directories: No error
  foo    bar
+ shell-init: error retrieving current directory: getcwd: cannot access parent directories: No error
  foo    bar
+ shell-init: error retrieving current directory: getcwd: cannot access parent directories: No error
  foo bar
+ shell-init: error retrieving current directory: getcwd: cannot access parent directories: No error
  foo bar
+ shell-init: error retrieving current directory: getcwd: cannot access parent directories: No error
  foo     bar
+ shell-init: error retrieving current directory: getcwd: cannot access parent directories: No error
  foo     bar

Contents of ./tests/work/misc/general3.diff.6:
*** work/misc/general3.base.6	Mon Jul  8 20:59:05 2013
--- work/misc/general3.log.6	Mon Jul  8 20:59:05 2013
***************
*** 1,16 ****
--- 1,24 ----
+ shell-init: error retrieving current directory: getcwd: cannot access parent directories: No error
  hi
  foobar
+ shell-init: error retrieving current directory: getcwd: cannot access parent directories: No error
  hi
  foobar
+ shell-init: error retrieving current directory: getcwd: cannot access parent directories: No error
  hi
  foo bar
+ shell-init: error retrieving current directory: getcwd: cannot access parent directories: No error
  hi
  foo bar
+ shell-init: error retrieving current directory: getcwd: cannot access parent directories: No error
  hi
  foo bar
+ shell-init: error retrieving current directory: getcwd: cannot access parent directories: No error
  hi
  foo bar
+ shell-init: error retrieving current directory: getcwd: cannot access parent directories: No error
  hi
  foo bar
+ shell-init: error retrieving current directory: getcwd: cannot access parent directories: No error
  hi
  foo bar

Contents of ./tests/work/misc/general3.diff.7:
*** work/misc/general3.base.7	Mon Jul  8 20:59:05 2013
--- work/misc/general3.log.7	Mon Jul  8 20:59:05 2013
***************
*** 1,16 ****
--- 1,24 ----
+ shell-init: error retrieving current directory: getcwd: cannot access parent directories: No error
  foobar
  hi
+ shell-init: error retrieving current directory: getcwd: cannot access parent directories: No error
  foobar
  hi
+ shell-init: error retrieving current directory: getcwd: cannot access parent directories: No error
  foo bar
  hi
+ shell-init: error retrieving current directory: getcwd: cannot access parent directories: No error
  foo bar
  hi
+ shell-init: error retrieving current directory: getcwd: cannot access parent directories: No error
  foo bar
  hi
+ shell-init: error retrieving current directory: getcwd: cannot access parent directories: No error
  foo bar
  hi
+ shell-init: error retrieving current directory: getcwd: cannot access parent directories: No error
  foo bar
  hi
+ shell-init: error retrieving current directory: getcwd: cannot access parent directories: No error
  foo bar
  hi

Contents of ./tests/work/misc/general3.diff.8:
*** work/misc/general3.base.8	Mon Jul  8 20:59:05 2013
--- work/misc/general3.log.8	Mon Jul  8 20:59:05 2013
***************
*** 1,24 ****
--- 1,32 ----
+ shell-init: error retrieving current directory: getcwd: cannot access parent directories: No error
  hi
  foo\
  bar
+ shell-init: error retrieving current directory: getcwd: cannot access parent directories: No error
  hi
  foo\
  bar
+ shell-init: error retrieving current directory: getcwd: cannot access parent directories: No error
  hi
  foo\
      bar
+ shell-init: error retrieving current directory: getcwd: cannot access parent directories: No error
  hi
  foo\
      bar
+ shell-init: error retrieving current directory: getcwd: cannot access parent directories: No error
  hi
  foo \
  bar
+ shell-init: error retrieving current directory: getcwd: cannot access parent directories: No error
  hi
  foo \
  bar
+ shell-init: error retrieving current directory: getcwd: cannot access parent directories: No error
  hi
  foo \
      bar
+ shell-init: error retrieving current directory: getcwd: cannot access parent directories: No error
  hi
  foo \
      bar

Contents of ./tests/work/misc/general3.diff.9:
*** work/misc/general3.base.9	Mon Jul  8 20:59:05 2013
--- work/misc/general3.log.9	Mon Jul  8 20:59:05 2013
***************
*** 1,16 ****
--- 1,24 ----
+ shell-init: error retrieving current directory: getcwd: cannot access parent directories: No error
  hi
  foobar
+ shell-init: error retrieving current directory: getcwd: cannot access parent directories: No error
  hi
  foobar
+ shell-init: error retrieving current directory: getcwd: cannot access parent directories: No error
  hi
  foo    bar
+ shell-init: error retrieving current directory: getcwd: cannot access parent directories: No error
  hi
  foo    bar
+ shell-init: error retrieving current directory: getcwd: cannot access parent directories: No error
  hi
  foo bar
+ shell-init: error retrieving current directory: getcwd: cannot access parent directories: No error
  hi
  foo bar
+ shell-init: error retrieving current directory: getcwd: cannot access parent directories: No error
  hi
  foo     bar
+ shell-init: error retrieving current directory: getcwd: cannot access parent directories: No error
  hi
  foo     bar

Contents of ./tests/work/misc/general4.diff.1:
*** work/misc/general4.base.1	Mon Jul  8 20:59:05 2013
--- work/misc/general4.log.1	Mon Jul  8 20:59:05 2013
***************
*** 1,2 ****
--- 1,3 ----
+ shell-init: error retrieving current directory: getcwd: cannot access parent directories: No error
  cc -c foo.c
  cc foo.o -o foo

Contents of ./tests/work/options/dash-B.diff.2:
*** work/options/dash-B.base.2	Mon Jul  8 20:59:05 2013
--- work/options/dash-B.log.2	Mon Jul  8 20:59:05 2013
***************
*** 1 ****
--- 1,2 ----
  cp bar.x foo
+ shell-init: error retrieving current directory: getcwd: cannot access parent directories: No error

Contents of ./tests/work/options/dash-B.diff.4:
*** work/options/dash-B.base.4	Mon Jul  8 20:59:05 2013
--- work/options/dash-B.log.4	Mon Jul  8 20:59:05 2013
***************
*** 1 ****
--- 1,4 ----
+ make: Warning: File `foo' has modification time 999 s in the future
  cp bar.x foo
+ shell-init: error retrieving current directory: getcwd: cannot access parent directories: No error
+ make: warning:  Clock skew detected.  Your build may be incomplete.

Contents of ./tests/work/options/dash-I.diff.2:
*** work/options/dash-I.base.2	Mon Jul  8 20:59:06 2013
--- work/options/dash-I.log.2	Mon Jul  8 20:59:06 2013
***************
*** 1,4 ****
! /home/Greg/make-3.82/tests/../make ANOTHER -f work/options/dash-I.mk
  make[1]: Entering directory `/home/Greg/make-3.82/tests'
  This is another included makefile
  make[1]: Leaving directory `/home/Greg/make-3.82/tests'
--- 1,4 ----
! ../make ANOTHER -f work/options/dash-I.mk
  make[1]: Entering directory `/home/Greg/make-3.82/tests'
  This is another included makefile
  make[1]: Leaving directory `/home/Greg/make-3.82/tests'

Contents of ./tests/work/options/dash-k.diff.1:
*** work/options/dash-k.base.1	Mon Jul  8 20:59:07 2013
--- work/options/dash-k.log.1	Mon Jul  8 20:59:07 2013
***************
*** 1,3 ****
--- 1,4 ----
  exit 1
+ shell-init: error retrieving current directory: getcwd: cannot access parent directories: No error
  make: *** [foo.o] Error 1
  make: Target `all' not remade because of errors.

Contents of ./tests/work/options/dash-W.diff.2:
*** work/options/dash-W.base.2	Mon Jul  8 20:59:06 2013
--- work/options/dash-W.log.2	Mon Jul  8 20:59:06 2013
***************
*** 1 ****
--- 1,2 ----
  echo >> a.x
+ shell-init: error retrieving current directory: getcwd: cannot access parent directories: No error

Contents of ./tests/work/options/dash-W.diff.4:
*** work/options/dash-W.base.4	Mon Jul  8 20:59:06 2013
--- work/options/dash-W.log.4	Mon Jul  8 20:59:06 2013
***************
*** 1 ****
--- 1,4 ----
+ make: Warning: File `a.x' has modification time 999 s in the future
  echo >> a.x
+ shell-init: error retrieving current directory: getcwd: cannot access parent directories: No error
+ make: warning:  Clock skew detected.  Your build may be incomplete.

Contents of ./tests/work/options/dash-W.diff.5:
*** work/options/dash-W.base.5	Mon Jul  8 20:59:06 2013
--- work/options/dash-W.log.5	Mon Jul  8 20:59:06 2013
***************
*** 1,5 ****
--- 1,9 ----
  work/options/dash-W.mk.1:3: foo.x: No such file or directory
  echo >> bar.x
+ shell-init: error retrieving current directory: getcwd: cannot access parent directories: No error
+ shell-init: error retrieving current directory: getcwd: cannot access parent directories: No error
+ shell-init: error retrieving current directory: getcwd: cannot access parent directories: No error
  touch foo.x
  restarts=1
+ shell-init: error retrieving current directory: getcwd: cannot access parent directories: No error
  touch baz.x

Contents of ./tests/work/options/dash-W.diff.6:
*** work/options/dash-W.base.6	Mon Jul  8 20:59:06 2013
--- work/options/dash-W.log.6	Mon Jul  8 20:59:06 2013
***************
*** 1,4 ****
--- 1,8 ----
  restarts=
+ make: Warning: File `foo.x' has modification time 999 s in the future
+ shell-init: error retrieving current directory: getcwd: cannot access parent directories: No error
+ shell-init: error retrieving current directory: getcwd: cannot access parent directories: No error
  touch foo.x
  restarts=1
+ shell-init: error retrieving current directory: getcwd: cannot access parent directories: No error
  touch baz.x

Contents of ./tests/work/options/eval.diff.1:
*** work/options/eval.base.1	Mon Jul  8 20:59:09 2013
--- work/options/eval.log.1	Mon Jul  8 20:59:09 2013
***************
*** 1,4 ****
--- 1,7 ----
+ shell-init: error retrieving current directory: getcwd: cannot access parent directories: No error
  eval
+ shell-init: error retrieving current directory: getcwd: cannot access parent directories: No error
+ job-working-directory: error retrieving current directory: getcwd: cannot access parent directories: No error
  eval
  all
  recurse

Contents of ./tests/work/options/general.diff.1:
*** work/options/general.base.1	Mon Jul  8 20:59:09 2013
--- work/options/general.log.1	Mon Jul  8 20:59:09 2013
***************
*** 0 ****
--- 1,2 ----
+ shell-init: error retrieving current directory: getcwd: cannot access parent directories: No error
+ job-working-directory: error retrieving current directory: getcwd: cannot access parent directories: No error

Contents of ./tests/work/targets/INTERMEDIATE.diff.3:
*** work/targets/INTERMEDIATE.base.3	Mon Jul  8 20:59:10 2013
--- work/targets/INTERMEDIATE.log.3	Mon Jul  8 20:59:10 2013
***************
*** 1,4 ****
--- 1,6 ----
  cp foo.f foo.e
  cp bar.f bar.e
  cat foo.e bar.e > foo.c
+ shell-init: error retrieving current directory: getcwd: cannot access parent directories: No error
+ job-working-directory: error retrieving current directory: getcwd: cannot access parent directories: No such file or directory
  rm bar.e foo.e

Contents of ./tests/work/targets/INTERMEDIATE.diff.5:
*** work/targets/INTERMEDIATE.base.5	Mon Jul  8 20:59:10 2013
--- work/targets/INTERMEDIATE.log.5	Mon Jul  8 20:59:10 2013
***************
*** 1,4 ****
--- 1,6 ----
  cp foo.f foo.e
  cp bar.f bar.e
  cat foo.e bar.e > foo.c
+ shell-init: error retrieving current directory: getcwd: cannot access parent directories: No error
+ job-working-directory: error retrieving current directory: getcwd: cannot access parent directories: No such file or directory
  rm bar.e foo.e

Contents of ./tests/work/targets/ONESHELL.diff.1:
*** work/targets/ONESHELL.base.1	Mon Jul  8 20:59:10 2013
--- work/targets/ONESHELL.log.1	Mon Jul  8 20:59:10 2013
***************
*** 1,2 ****
--- 1,3 ----
  a=$$
  [ 0"$a" -eq "$$" ] || echo fail
+ shell-init: error retrieving current directory: getcwd: cannot access parent directories: No error

Contents of ./tests/work/targets/ONESHELL.diff.2:
*** work/targets/ONESHELL.base.2	Mon Jul  8 20:59:10 2013
--- work/targets/ONESHELL.log.2	Mon Jul  8 20:59:10 2013
***************
*** 0 ****
--- 1 ----
+ shell-init: error retrieving current directory: getcwd: cannot access parent directories: No error

Contents of ./tests/work/targets/ONESHELL.diff.3:
*** work/targets/ONESHELL.base.3	Mon Jul  8 20:59:10 2013
--- work/targets/ONESHELL.log.3	Mon Jul  8 20:59:10 2013
***************
*** 0 ****
--- 1 ----
+ shell-init: error retrieving current directory: getcwd: cannot access parent directories: No error

Contents of ./tests/work/variables/automatic.diff.5:
*** work/variables/automatic.base.5	Mon Jul  8 20:59:15 2013
--- work/variables/automatic.log.5	Mon Jul  8 20:59:15 2013
***************
*** 1 ****
--- 1,2 ----
+ shell-init: error retrieving current directory: getcwd: cannot access parent directories: No error
  $? = bar

Contents of ./tests/work/variables/LIBPATTERNS.diff.1:
*** work/variables/LIBPATTERNS.base.1	Mon Jul  8 20:59:13 2013
--- work/variables/LIBPATTERNS.log.1	Mon Jul  8 20:59:13 2013
***************
*** 1,2 ****
--- 1,3 ----
  make: .LIBPATTERNS element `mtest_foo.a' is not a pattern
+ shell-init: error retrieving current directory: getcwd: cannot access parent directories: No error
  build all from mtest_foo.a

Contents of ./tests/work/variables/MAKE_RESTARTS.diff.1:
*** work/variables/MAKE_RESTARTS.base.1	Mon Jul  8 20:59:14 2013
--- work/variables/MAKE_RESTARTS.log.1	Mon Jul  8 20:59:14 2013
***************
*** 1,5 ****
--- 1,6 ----
  MAKE_RESTARTS=
  work/variables/MAKE_RESTARTS.mk.1:4: foo.x: No such file or directory
+ shell-init: error retrieving current directory: getcwd: cannot access parent directories: No error
  MAKE_RESTARTS=1
  foo.x:1: bar.x: No such file or directory
  MAKE_RESTARTS=2

Contents of ./tests/work/variables/MAKE_RESTARTS.diff.2:
*** work/variables/MAKE_RESTARTS.base.2	Mon Jul  8 20:59:14 2013
--- work/variables/MAKE_RESTARTS.log.2	Mon Jul  8 20:59:14 2013
***************
*** 1,10 ****
--- 1,13 ----
  MAKE_RESTARTS=
  work/variables/MAKE_RESTARTS.mk.2:8: foo.x: No such file or directory
+ shell-init: error retrieving current directory: getcwd: cannot access parent directories: No error
  MAKE_RESTARTS=1
  foo.x:1: bar.x: No such file or directory
  MAKE_RESTARTS=2
+ shell-init: error retrieving current directory: getcwd: cannot access parent directories: No error
  recurse MAKE_RESTARTS=
  MAKE_RESTARTS=
  make[1]: Entering directory `/home/Greg/make-3.82/tests'
+ shell-init: error retrieving current directory: getcwd: cannot access parent directories: No error
  all MAKE_RESTARTS=
  make[1]: Leaving directory `/home/Greg/make-3.82/tests'

Contents of ./tests/work/variables/negative.diff.1:
*** work/variables/negative.base.1	Mon Jul  8 20:59:16 2013
--- work/variables/negative.log.1	Mon Jul  8 20:59:16 2013
***************
*** 1 ****
--- 1,2 ----
+ shell-init: error retrieving current directory: getcwd: cannot access parent directories: No error
  work/variables/negative.mk:4: *** unterminated variable reference.  Stop.

Contents of ./tests/work/variables/negative.diff.3:
*** work/variables/negative.base.3	Mon Jul  8 20:59:16 2013
--- work/variables/negative.log.3	Mon Jul  8 20:59:16 2013
***************
*** 1 ****
--- 1,2 ----
+ shell-init: error retrieving current directory: getcwd: cannot access parent directories: No error
  work/variables/negative.mk.1:4: *** unterminated variable reference.  Stop.

Contents of ./tests/work/variables/private.diff.4:
*** work/variables/private.base.4	Mon Jul  8 20:59:16 2013
--- work/variables/private.log.4	Mon Jul  8 20:59:16 2013
***************
*** 1 ****
--- 1,2 ----
+ shell-init: error retrieving current directory: getcwd: cannot access parent directories: No error
  _X=a / _X=a

Contents of ./tests/work/variables/private.diff.5:
*** work/variables/private.base.5	Mon Jul  8 20:59:16 2013
--- work/variables/private.log.5	Mon Jul  8 20:59:16 2013
***************
*** 1 ****
--- 1,2 ----
+ shell-init: error retrieving current directory: getcwd: cannot access parent directories: No error
  _X=a / _X=a

Contents of ./tests/work/variables/SHELL.diff.1:
*** work/variables/SHELL.base.1	Mon Jul  8 20:59:14 2013
--- work/variables/SHELL.log.1	Mon Jul  8 20:59:14 2013
***************
*** 1 ****
--- 1,2 ----
+ shell-init: error retrieving current directory: getcwd: cannot access parent directories: No error
  /.//bin/sh /bin/sh

Contents of ./tests/work/variables/SHELL.diff.2:
*** work/variables/SHELL.base.2	Mon Jul  8 20:59:14 2013
--- work/variables/SHELL.log.2	Mon Jul  8 20:59:14 2013
***************
*** 1 ****
--- 1,2 ----
+ shell-init: error retrieving current directory: getcwd: cannot access parent directories: No error
  /.//bin/sh /.//bin/sh

Contents of ./tests/work/variables/SHELL.diff.3:
*** work/variables/SHELL.base.3	Mon Jul  8 20:59:14 2013
--- work/variables/SHELL.log.3	Mon Jul  8 20:59:14 2013
***************
*** 1 ****
--- 1,2 ----
+ shell-init: error retrieving current directory: getcwd: cannot access parent directories: No error
  /.//bin/sh /bin/sh

Contents of ./tests/work/variables/SHELL.diff.4:
*** work/variables/SHELL.base.4	Mon Jul  8 20:59:14 2013
--- work/variables/SHELL.log.4	Mon Jul  8 20:59:14 2013
***************
*** 1,2 ****
--- 1,4 ----
+ shell-init: error retrieving current directory: getcwd: cannot access parent directories: No error
  two: /.//bin/sh /.//bin/sh
+ shell-init: error retrieving current directory: getcwd: cannot access parent directories: No error
  one: /././/bin/sh /bin/sh

Contents of ./tests/work/variables/special.diff.1:
*** work/variables/special.base.1	Mon Jul  8 20:59:16 2013
--- work/variables/special.log.1	Mon Jul  8 20:59:16 2013
***************
*** 1,27 ****
--- 1,45 ----
  : orig-one
+ shell-init: error retrieving current directory: getcwd: cannot access parent directories: No error
  : orig-two \
  orig-three \
  orig-four \
  	orig-five \\
+ shell-init: error retrieving current directory: getcwd: cannot access parent directories: No error
  : orig-six
+ shell-init: error retrieving current directory: getcwd: cannot access parent directories: No error
  : foo-one foo-two
+ shell-init: error retrieving current directory: getcwd: cannot access parent directories: No error
  : foo-three
+ shell-init: error retrieving current directory: getcwd: cannot access parent directories: No error
  : foo-four
+ shell-init: error retrieving current directory: getcwd: cannot access parent directories: No error
  : test-one
+ shell-init: error retrieving current directory: getcwd: cannot access parent directories: No error
  : test-two \
  test-three \
  test-four \
  	test-five \\
+ shell-init: error retrieving current directory: getcwd: cannot access parent directories: No error
  : test-six
+ shell-init: error retrieving current directory: getcwd: cannot access parent directories: No error
  : foo-one foo-two
+ shell-init: error retrieving current directory: getcwd: cannot access parent directories: No error
  : foo-three
+ shell-init: error retrieving current directory: getcwd: cannot access parent directories: No error
  : foo-four
+ shell-init: error retrieving current directory: getcwd: cannot access parent directories: No error
  : reset-one
+ shell-init: error retrieving current directory: getcwd: cannot access parent directories: No error
  : reset-two \
  reset-three \
  reset-four \
  	reset-five \\
+ shell-init: error retrieving current directory: getcwd: cannot access parent directories: No error
  : reset-six
+ shell-init: error retrieving current directory: getcwd: cannot access parent directories: No error
  : foo-one foo-two
+ shell-init: error retrieving current directory: getcwd: cannot access parent directories: No error
  : foo-three
+ shell-init: error retrieving current directory: getcwd: cannot access parent directories: No error
  : foo-four
+ shell-init: error retrieving current directory: getcwd: cannot access parent directories: No error

[-- Attachment #3: cygcheck.out --]
[-- Type: application/octet-stream, Size: 21250 bytes --]


Cygwin Configuration Diagnostics
Current System Time: Tue Jul 09 03:28:48 2013

Windows 8 Professional N Ver 6.2 Build 9200 

Path:	D:\Cygwin\usr\local\bin
	D:\Cygwin\bin
	C:\Windows\system32
	C:\Windows
	C:\Windows\System32\Wbem
	C:\Windows\System32\WindowsPowerShell\v1.0
	C:\PROGRA~1\CONDUS~1\DISKEE~1
	C:\Program Files (x86)\ATI Technologies\ATI.ACE\Core-Static
	C:\Program Files\Intel\WiFi\bin
	C:\Program Files\Common Files\Intel\WirelessCommon
	C:\Program Files\WIDCOMM\Bluetooth Software
	C:\Program Files\WIDCOMM\Bluetooth Software\syswow64
	C:\Program Files\Intel\WiFi\bin
	C:\Program Files\Common Files\Intel\WirelessCommon
	D:\ADT 2013-05-22\sdk\platform-tools
	D:\ADT 2013-05-22\sdk\build-tools\android-4.2.2

Output from D:\Cygwin\bin\id.exe
UID: 1001(Greg) GID: 513(None)
513(None)       545(Users)      1002(HomeUsers)

SysDir: C:\Windows\system32
WinDir: C:\Windows

LIBRARY_PATH = '/usr/local/lib'
USER = 'Greg'
LD_LIBRARY_PATH = '/usr/local/lib'
PWD = '/home/Greg'
HOME = '/home/Greg'

USERDOMAIN_ROAMINGPROFILE = 'BABYPLATYPUS'
HOMEPATH = '\Users\Greg'
MANPATH = '/usr/local/man:/usr/share/man:/usr/man:'
APPDATA = 'C:\Users\Greg\AppData\Roaming'
ProgramW6432 = 'C:\Program Files'
HOSTNAME = 'BabyPlatypus'
SHELL = '/bin/bash'
TERM = 'xterm'
PROCESSOR_IDENTIFIER = 'Intel64 Family 6 Model 42 Stepping 7, GenuineIntel'
WINDIR = 'C:\Windows'
PUBLIC = 'C:\Users\Public'
OLDPWD = '/home/Greg/make-3.81'
USERDOMAIN = 'BABYPLATYPUS'
CommonProgramFiles(x86) = 'C:\Program Files (x86)\Common Files'
OS = 'Windows_NT'
ALLUSERSPROFILE = 'C:\ProgramData'
temp = 'C:\Users\Greg\AppData\Local\Temp'
COMMONPROGRAMFILES = 'C:\Program Files\Common Files'
TMP = '/tmp'
CPATH = '/usr/local/include'
USERNAME = 'Greg'
PROCESSOR_LEVEL = '6'
ProgramFiles(x86) = 'C:\Program Files (x86)'
PSModulePath = 'C:\Windows\system32\WindowsPowerShell\v1.0\Modules\'
FP_NO_HOST_CHECK = 'NO'
SYSTEMDRIVE = 'C:'
LANG = 'en_US.UTF-8'
USERPROFILE = 'C:\Users\Greg'
TZ = 'America/Denver'
PS1 = '\[\e]0;\w\a\]\n\[\e[32m\]\u@\h \[\e[33m\]\w\[\e[0m\]\n\$ '
LOGONSERVER = '\\MicrosoftAccount'
CommonProgramW6432 = 'C:\Program Files\Common Files'
PROCESSOR_ARCHITECTURE = 'AMD64'
LOCALAPPDATA = 'C:\Users\Greg\AppData\Local'
ProgramData = 'C:\ProgramData'
SHLVL = '1'
PATHEXT = '.COM;.EXE;.BAT;.CMD;.VBS;.VBE;.JS;.JSE;.WSF;.WSH;.MSC'
HOMEDRIVE = 'C:'
COMSPEC = 'C:\Windows\system32\cmd.exe'
SYSTEMROOT = 'C:\Windows'
PRINTER = 'HPB47616 (HP Officejet Pro 8600)'
PROCESSOR_REVISION = '2a07'
INFOPATH = '/usr/local/info:/usr/share/info:/usr/info:'
PROGRAMFILES = 'C:\Program Files'
NUMBER_OF_PROCESSORS = '8'
SESSIONNAME = 'Console'
COMPUTERNAME = 'BABYPLATYPUS'
_ = '/usr/bin/cygcheck'

HKEY_CURRENT_USER\Software\Cygwin
HKEY_CURRENT_USER\Software\Cygwin\Installations
  (default) = '\??\D:\Cygwin'
HKEY_CURRENT_USER\Software\Cygwin\Program Options
HKEY_CURRENT_USER\Software\Cygwin\setup
HKEY_LOCAL_MACHINE\SOFTWARE\Cygwin
HKEY_LOCAL_MACHINE\SOFTWARE\Cygwin\Installations
  (default) = '\??\D:\Cygwin'
HKEY_LOCAL_MACHINE\SOFTWARE\Cygwin\Program Options
HKEY_LOCAL_MACHINE\SOFTWARE\Cygwin\setup
  (default) = 'D:\Cygwin'
HKEY_LOCAL_MACHINE\SOFTWARE\Wow6432Node\Cygwin
HKEY_LOCAL_MACHINE\SOFTWARE\Wow6432Node\Cygwin\Installations
  (default) = '\??\D:\Cygwin'
HKEY_LOCAL_MACHINE\SOFTWARE\Wow6432Node\Cygwin\Program Options
HKEY_LOCAL_MACHINE\SOFTWARE\Wow6432Node\Cygwin\setup
  (default) = 'D:\Cygwin'

obcaseinsensitive set to 1

Cygwin installations found in the registry:
  System: Key: 1720b01b097bf4fc Path: D:\Cygwin
  User:   Key: 1720b01b097bf4fc Path: D:\Cygwin

a:  hd  NTFS       198Mb  25% CP CS UN PA FC     SYSTEM
b:  hd  NTFS    131071Mb  31% CP CS UN PA FC     Windows 7
c:  hd  NTFS     65534Mb  80% CP CS UN PA FC     Windows 8
d:  hd  NTFS    369020Mb  59% CP CS UN PA        Data
e:  cd             N/A    N/A                    

D:\Cygwin        /          system  binary,auto
D:\Cygwin\bin    /usr/bin   system  binary,auto
D:\Cygwin\lib    /usr/lib   system  binary,auto
cygdrive prefix  /cygdrive  user    binary,posix=0,auto

Found: D:\Cygwin\bin\awk
 -> D:\Cygwin\bin\gawk.exe
Found: D:\Cygwin\bin\bash.exe
Found: D:\Cygwin\bin\cat.exe
Found: D:\Cygwin\bin\cp.exe
Found: D:\Cygwin\bin\cpp.exe
Not Found: crontab
Found: D:\Cygwin\bin\find.exe
Found: C:\Windows\system32\find.exe
Warning: D:\Cygwin\bin\find.exe hides C:\Windows\system32\find.exe
Found: D:\Cygwin\bin\gcc.exe
Found: D:\Cygwin\bin\gdb.exe
Found: D:\Cygwin\bin\grep.exe
Found: D:\Cygwin\bin\kill.exe
Found: D:\Cygwin\bin\ld.exe
Found: D:\Cygwin\bin\ls.exe
Found: D:\Cygwin\bin\make.exe
Found: D:\Cygwin\bin\mv.exe
Found: D:\Cygwin\bin\patch.exe
Found: D:\Cygwin\bin\perl.exe
Found: D:\Cygwin\bin\rm.exe
Found: D:\Cygwin\bin\sed.exe
Found: D:\Cygwin\bin\ssh.exe
Found: D:\Cygwin\bin\sh.exe
Found: D:\Cygwin\bin\tar.exe
Found: D:\Cygwin\bin\test.exe
Found: D:\Cygwin\bin\vi.exe
Not Found: vim

  575k 2013/05/30 D:\Cygwin\bin\cygarchive-13.dll - os=4.0 img=0.0 sys=5.2
                  "cygarchive-13.dll" v0.0 ts=2013-05-30 03:06
    9k 2013/03/08 D:\Cygwin\bin\cygasprintf-0.dll - os=4.0 img=0.0 sys=5.2
                  "cygasprintf-0.dll" v0.0 ts=2013-03-08 05:49
   87k 2013/05/31 D:\Cygwin\bin\cygatomic-1.dll - os=4.0 img=0.0 sys=5.2
                  "cygatomic-1.dll" v0.0 ts=2013-05-31 22:32
   16k 2013/03/26 D:\Cygwin\bin\cygattr-1.dll - os=4.0 img=0.0 sys=5.2
                  "cygattr-1.dll" v0.0 ts=2013-03-26 18:26
  125k 2013/03/11 D:\Cygwin\bin\cygblkid-1.dll - os=4.0 img=0.0 sys=5.2
                  "cygblkid-1.dll" v0.0 ts=2013-03-11 03:08
   64k 2013/03/07 D:\Cygwin\bin\cygbz2-1.dll - os=4.0 img=0.0 sys=5.2
                  "cygbz2-1.dll" v0.0 ts=2013-03-07 02:54
   13k 2013/03/06 D:\Cygwin\bin\cygcatgets1.dll - os=4.0 img=0.0 sys=5.2
                  "cygcatgets1.dll" v0.0 ts=2013-03-06 14:34
   31k 2013/05/06 D:\Cygwin\bin\cygcheck-0.dll - os=4.0 img=0.0 sys=5.2
                  "cygcheck-0.dll" v0.0 ts=2013-05-06 06:37
  117k 2013/05/05 D:\Cygwin\bin\cygcloog-isl-4.dll - os=4.0 img=0.0 sys=5.2
                  "cygcloog-isl-4.dll" v0.0 ts=2013-05-05 16:41
  187k 2013/06/05 D:\Cygwin\bin\cygcppunit-1-12-1.dll - os=4.0 img=0.0 sys=5.2
                  "cygcppunit-1-12-1.dll" v0.0 ts=2013-06-05 18:21
    9k 2013/03/07 D:\Cygwin\bin\cygcrypt-0.dll - os=4.0 img=0.0 sys=5.2
                  "cygcrypt-0.dll" v0.0 ts=2013-03-07 09:29
 1655k 2013/03/07 D:\Cygwin\bin\cygcrypto-1.0.0.dll - os=4.0 img=0.0 sys=5.2
                  "cygcrypto-1.0.0.dll" v0.0 ts=2013-03-07 12:01
  356k 2013/03/12 D:\Cygwin\bin\cygcurl-4.dll - os=4.0 img=0.0 sys=5.2
                  "cygcurl-4.dll" v0.0 ts=2013-03-12 04:31
 1526k 2013/03/08 D:\Cygwin\bin\cygdb-5.3.dll - os=4.0 img=0.0 sys=5.2
                  "cygdb-5.3.dll" v0.0 ts=2013-03-08 07:55
  111k 2013/03/08 D:\Cygwin\bin\cygdb_cxx-5.3.dll - os=4.0 img=0.0 sys=5.2
                  "cygdb_cxx-5.3.dll" v0.0 ts=2013-03-08 07:56
  472k 2013/03/08 D:\Cygwin\bin\cygdb_sql-5.3.dll - os=4.0 img=0.0 sys=5.2
                  "cygdb_sql-5.3.dll" v0.0 ts=2013-03-08 07:58
  155k 2013/03/15 D:\Cygwin\bin\cygedit-0.dll - os=4.0 img=0.0 sys=5.2
                  "cygedit-0.dll" v0.0 ts=2013-03-15 09:44
   79k 2013/06/18 D:\Cygwin\bin\cygelf-0.dll - os=4.0 img=0.0 sys=5.2
                  "cygelf-0.dll" v0.0 ts=2013-06-18 01:21
  146k 2013/04/16 D:\Cygwin\bin\cygexpat-1.dll - os=4.0 img=0.0 sys=5.2
                  "cygexpat-1.dll" v0.0 ts=2013-04-16 15:24
   22k 2013/05/12 D:\Cygwin\bin\cygffi-6.dll - os=4.0 img=0.0 sys=5.2
                  "cygffi-6.dll" v0.0 ts=2013-05-12 22:53
   53k 2013/05/06 D:\Cygwin\bin\cygformw-10.dll - os=4.0 img=0.0 sys=5.2
                  "cygformw-10.dll" v0.0 ts=2013-05-06 08:10
   66k 2013/05/31 D:\Cygwin\bin\cyggcc_s-seh-1.dll - os=4.0 img=0.0 sys=5.2
                  "cyggcc_s-seh-1.dll" v0.0 ts=2013-05-31 22:17
   29k 2013/03/11 D:\Cygwin\bin\cyggdbm-4.dll - os=4.0 img=0.0 sys=5.2
                  "cyggdbm-4.dll" v0.0 ts=2013-03-11 05:00
   12k 2013/03/11 D:\Cygwin\bin\cyggdbm_compat-4.dll - os=4.0 img=0.0 sys=5.2
                  "cyggdbm_compat-4.dll" v0.0 ts=2013-03-11 05:01
 1087k 2013/03/08 D:\Cygwin\bin\cyggettextlib-0-18-1.dll - os=4.0 img=0.0 sys=5.2
                  "cyggettextlib-0-18-1.dll" v0.0 ts=2013-03-08 05:55
  262k 2013/03/08 D:\Cygwin\bin\cyggettextpo-0.dll - os=4.0 img=0.0 sys=5.2
                  "cyggettextpo-0.dll" v0.0 ts=2013-03-08 06:02
  228k 2013/03/08 D:\Cygwin\bin\cyggettextsrc-0-18-1.dll - os=4.0 img=0.0 sys=5.2
                  "cyggettextsrc-0-18-1.dll" v0.0 ts=2013-03-08 05:57
 1107k 2013/05/31 D:\Cygwin\bin\cyggfortran-3.dll - os=4.0 img=0.0 sys=5.2
                  "cyggfortran-3.dll" v0.0 ts=2013-05-31 22:40
  443k 2013/05/05 D:\Cygwin\bin\cyggmp-10.dll - os=4.0 img=0.0 sys=5.2
                  "cyggmp-10.dll" v0.0 ts=2013-05-05 13:28
   21k 2013/05/05 D:\Cygwin\bin\cyggmpxx-4.dll - os=4.0 img=0.0 sys=5.2
                  "cyggmpxx-4.dll" v0.0 ts=2013-05-05 13:28
   46k 2013/05/31 D:\Cygwin\bin\cyggomp-1.dll - os=4.0 img=0.0 sys=5.2
                  "cyggomp-1.dll" v0.0 ts=2013-05-31 22:18
  691k 2013/04/22 D:\Cygwin\bin\cygguile-17.dll - os=4.0 img=0.0 sys=5.2
                  "cygguile-17.dll" v0.0 ts=2013-04-22 03:15
   29k 2013/03/14 D:\Cygwin\bin\cyghistory7.dll - os=4.0 img=0.0 sys=5.2
                  "cyghistory7.dll" v0.0 ts=2013-03-14 11:14
  360k 2013/06/07 D:\Cygwin\bin\cygicons-0.dll - os=4.0 img=1.4 sys=5.2
                  "cygicons-0.dll" v0.0 ts=2013-06-07 03:42
  998k 2013/03/07 D:\Cygwin\bin\cygiconv-2.dll - os=4.0 img=0.0 sys=5.2
                  "cygiconv-2.dll" v0.0 ts=2013-03-07 03:03
   39k 2013/03/08 D:\Cygwin\bin\cygintl-8.dll - os=4.0 img=0.0 sys=5.2
                  "cygintl-8.dll" v0.0 ts=2013-03-08 05:50
  888k 2013/05/05 D:\Cygwin\bin\cygisl-10.dll - os=4.0 img=0.0 sys=5.2
                  "cygisl-10.dll" v0.0 ts=2013-05-05 16:36
    6k 2013/06/28 D:\Cygwin\bin\cyglsa64.dll - os=4.0 img=0.0 sys=5.2
                  "cyglsa64.dll" v0.0 ts=2013-06-28 09:02
   34k 2013/05/27 D:\Cygwin\bin\cygltdl-7.dll - os=4.0 img=0.0 sys=5.2
                  "cygltdl-7.dll" v0.0 ts=2013-05-27 07:22
  129k 2013/03/07 D:\Cygwin\bin\cyglzma-5.dll - os=4.0 img=0.0 sys=5.2
                  "cyglzma-5.dll" v0.0 ts=2013-03-07 10:20
  124k 2013/03/19 D:\Cygwin\bin\cyglzo2-2.dll - os=4.0 img=0.0 sys=5.2
                  "cyglzo2-2.dll" v0.0 ts=2013-03-19 05:35
  102k 2013/03/19 D:\Cygwin\bin\cygmagic-1.dll - os=4.0 img=0.0 sys=5.2
                  "cygmagic-1.dll" v0.0 ts=2013-03-19 14:27
   28k 2013/05/06 D:\Cygwin\bin\cygmenuw-10.dll - os=4.0 img=0.0 sys=5.2
                  "cygmenuw-10.dll" v0.0 ts=2013-05-06 08:10
   85k 2013/05/05 D:\Cygwin\bin\cygmpc-3.dll - os=4.0 img=0.0 sys=5.2
                  "cygmpc-3.dll" v0.0 ts=2013-05-05 13:46
  319k 2013/05/05 D:\Cygwin\bin\cygmpfr-4.dll - os=4.0 img=0.0 sys=5.2
                  "cygmpfr-4.dll" v0.0 ts=2013-05-05 13:40
   52k 2013/05/06 D:\Cygwin\bin\cygncurses++w-10.dll - os=4.0 img=0.0 sys=5.2
                  "cygncurses++w-10.dll" v0.0 ts=2013-05-06 08:14
  295k 2013/05/06 D:\Cygwin\bin\cygncursesw-10.dll - os=4.0 img=0.0 sys=5.2
                  "cygncursesw-10.dll" v0.0 ts=2013-05-06 08:08
  177k 2013/05/14 D:\Cygwin\bin\cygnettle-4.dll - os=4.0 img=0.0 sys=5.2
                  "cygnettle-4.dll" v0.0 ts=2013-05-14 07:42
  122k 2013/05/31 D:\Cygwin\bin\cygobjc-4.dll - os=4.0 img=0.0 sys=5.2
                  "cygobjc-4.dll" v0.0 ts=2013-05-31 22:31
   13k 2013/05/06 D:\Cygwin\bin\cygpanelw-10.dll - os=4.0 img=0.0 sys=5.2
                  "cygpanelw-10.dll" v0.0 ts=2013-05-06 08:09
 1580k 2013/03/11 D:\Cygwin\bin\cygperl5_14.dll - os=4.0 img=0.0 sys=5.2
                  "cygperl5_14.dll" v0.0 ts=2013-03-12 00:25
   40k 2013/03/07 D:\Cygwin\bin\cygpopt-0.dll - os=4.0 img=0.0 sys=5.2
                  "cygpopt-0.dll" v0.0 ts=2013-03-07 12:01
  302k 2013/05/31 D:\Cygwin\bin\cygquadmath-0.dll - os=4.0 img=0.0 sys=5.2
                  "cygquadmath-0.dll" v0.0 ts=2013-05-31 22:32
  193k 2013/03/14 D:\Cygwin\bin\cygreadline7.dll - os=4.0 img=0.0 sys=5.2
                  "cygreadline7.dll" v0.0 ts=2013-03-14 11:14
  638k 2013/04/17 D:\Cygwin\bin\cygsqlite3-0.dll - os=4.0 img=0.0 sys=5.2
                  "cygsqlite3-0.dll" v0.0 ts=2013-04-17 21:50
  141k 2013/03/11 D:\Cygwin\bin\cygssh2-1.dll - os=4.0 img=0.0 sys=5.2
                  "cygssh2-1.dll" v0.0 ts=2013-03-11 11:42
  377k 2013/03/07 D:\Cygwin\bin\cygssl-1.0.0.dll - os=4.0 img=0.0 sys=5.2
                  "cygssl-1.0.0.dll" v0.0 ts=2013-03-07 12:01
   11k 2013/05/31 D:\Cygwin\bin\cygssp-0.dll - os=4.0 img=0.0 sys=5.2
                  "cygssp-0.dll" v0.0 ts=2013-05-31 22:31
  892k 2013/05/31 D:\Cygwin\bin\cygstdc++-6.dll - os=4.0 img=0.0 sys=5.2
                  "cygstdc++-6.dll" v0.0 ts=2013-05-31 22:23
   51k 2013/05/06 D:\Cygwin\bin\cygticw-10.dll - os=4.0 img=0.0 sys=5.2
                  "cygticw-10.dll" v0.0 ts=2013-05-06 08:08
   15k 2013/03/11 D:\Cygwin\bin\cyguuid-1.dll - os=4.0 img=0.0 sys=5.2
                  "cyguuid-1.dll" v0.0 ts=2013-03-11 03:07
 1212k 2013/04/21 D:\Cygwin\bin\cygxml2-2.dll - os=4.0 img=0.0 sys=5.2
                  "cygxml2-2.dll" v0.0 ts=2013-04-21 05:57
   79k 2013/05/09 D:\Cygwin\bin\cygz.dll - os=4.0 img=0.0 sys=5.2
                  "cygz.dll" v0.0 ts=2013-05-09 22:20
 3070k 2013/06/28 D:\Cygwin\bin\cygwin1.dll - os=4.0 img=0.0 sys=5.2
                  "cygwin1.dll" v0.0 ts=2013-06-28 09:03
    Cygwin DLL version info:
        DLL version: 1.7.21
        DLL epoch: 19
        DLL old termios: 5
        DLL malloc env: 28
        Cygwin conv: 181
        API major: 0
        API minor: 267
        Shared data: 5
        DLL identifier: cygwin1
        Mount registry: 3
        Cygwin registry name: Cygwin
        Program options name: Program Options
        Installations name: Installations
        Cygdrive default prefix: 
        Build date: 
        Shared id: cygwin1S5


No Cygwin services found.


Cygwin Package Information
Last downloaded files to: D:\Cygwin
Last downloaded files from: ftp://mirror.mcs.anl.gov/pub/cygwin/

Package              Version                   Status
alternatives         1.3.30c-10                OK
attr                 2.4.46-1                  OK
autoconf             12-1                      OK
autoconf2.1          2.13-11                   OK
autoconf2.5          2.69-1                    OK
automake             8-1                       OK
automake1.10         1.10.3-1                  OK
automake1.11         1.11.6-1                  OK
automake1.12         1.12.6-1                  OK
automake1.13         1.13.1-1                  OK
automake1.9          1.9.6-1                   OK
base-cygwin          3.3-1                     OK
base-files           4.1-1                     OK
bash                 4.1.11-1                  OK
bash-completion      1.3-1                     OK
binutils             2.23.52-5                 OK
bison                2.7.1-1                   OK
byacc                20130304-1                OK
bzip2                1.0.6-2                   OK
catgets              1.1-2                     OK
check                0.9.10-1                  OK
cloog-isl            0.18.0-2                  OK
cmake                2.8.10-2                  OK
coreutils            8.15-3                    OK
cppunit              1.12.1-2                  OK
crypt                1.1-1                     OK
csih                 0.9.7-1                   OK
cygrunsrv            1.42-1                    OK
cygutils             1.4.12-2                  OK
cygutils-extra       1.4.12-2                  OK
cygwin               1.7.21-6                  OK
dash                 0.5.7-4                   OK
diffutils            3.3-1                     OK
editrights           1.02-1                    OK
file                 5.13-1                    OK
findutils            4.5.11-1                  OK
flex                 2.5.37-3                  OK
gawk                 4.1.0-1                   OK
gcc-core             4.8.1-1                   OK
gcc-fortran          4.8.1-1                   OK
gcc-g++              4.8.1-1                   OK
gcc-objc             4.8.1-1                   OK
gcc-objc++           4.8.1-1                   OK
gdb                  7.6.50.20130320-cvs-1     OK
gettext              0.18.1.1-2                OK
gettext-devel        0.18.1.1-2                OK
git                  1.7.9-1                   OK
git-completion       1.7.9-1                   OK
gmp                  5.1.1-2                   OK
grep                 2.14-1                    OK
groff                1.22.2-1                  OK
guile                1.8.8-1                   OK
gzip                 1.4-1                     OK
hostname             3.12-1                    OK
ipc-utils            1.0-2                     OK
isl                  0.11.1-2                  OK
keychain             2.7.1-1                   OK
less                 458-1                     OK
libarchive13         3.1.2-2                   OK
libasprintf0         0.18.1.1-2                OK
libatomic1           4.8.1-1                   OK
libattr1             2.4.46-1                  OK
libblkid1            2.21.2-1                  OK
libbz2_1             1.0.6-2                   OK
libcatgets1          1.1-2                     OK
libcloog-isl4        0.18.0-2                  OK
libcrypt0            1.1-1                     OK
libcurl4             7.29.0-1                  OK
libdb5.3             5.3.21-1                  OK
libedit0             20120311-1                OK
libelf0              0.8.13-3                  OK
libexpat1            2.1.0-2                   OK
libffi6              3.0.13-1                  OK
libgcc1              4.8.1-1                   OK
libgdbm4             1.10-2                    OK
libgettextpo0        0.18.1.1-2                OK
libgfortran3         4.8.1-1                   OK
libgmp10             5.1.1-2                   OK
libgmpxx4            5.1.1-2                   OK
libgomp1             4.8.1-1                   OK
libguile17           1.8.8-1                   OK
libiconv             1.14-1                    OK
libiconv2            1.14-1                    OK
libintl8             0.18.1.1-2                OK
libisl10             0.11.1-2                  OK
libltdl7             2.4.2-3                   OK
liblzma5             5.0.4-1                   OK
liblzo2_2            2.06-1                    OK
libmpc3              1.0.1-2                   OK
libmpfr4             3.1.2-1                   OK
libncursesw10        5.9-4                     OK
libnettle4           2.7-1                     OK
libobjc4             4.8.1-1                   OK
libopenssl100        1.0.1e-1                  OK
libpopt0             1.16-1                    OK
libquadmath0         4.8.1-1                   OK
libreadline7         6.2-1                     OK
libsqlite3_0         3.7.16.2-1                OK
libssh2_1            1.4.2-1                   OK
libssp0              4.8.1-1                   OK
libstdc++6           4.8.1-1                   OK
libtool              2.4.2-3                   OK
libuuid1             2.21.2-1                  OK
libxml2              2.9.1-1                   OK
m4                   1.4.16-2                  OK
make                 3.82.90-1                 OK
man                  1.6g-2                    OK
mintty               1.2-beta1-1               OK
mpclib               1.0.1-2                   OK
mpfr                 3.1.2-1                   OK
ncurses              5.9-4                     OK
openssh              6.2p2-1                   OK
patch                2.7.1-1                   OK
perl                 5.14.4-1                  OK
perl-Error           0.17019-1                 OK
python               2.7.3-1                   OK
rebase               4.4.0.1-1                 OK
rsync                3.0.9-1                   OK
run                  1.2.0-1                   OK
screen               4.1.0-20130513-2          OK
sed                  4.2.2-3                   OK
tar                  1.26-1                    OK
tcsh                 6.18.01-3                 OK
terminfo             5.9-4                     OK
texinfo              4.13-1                    OK
tzcode               2013c-1                   OK
util-linux           2.21.2-1                  OK
vim-minimal          7.3.1152-1                OK
w32api-headers       3.0b_svn5726-1            OK
w32api-runtime       3.0b_svn5726-1            OK
which                2.20-2                    OK
xz                   5.0.4-1                   OK
zlib0                1.2.8-1                   OK
Use -h to see help about each section

[-- Attachment #4: conf-make-inst.sh --]
[-- Type: application/x-sh, Size: 414 bytes --]

[-- Attachment #5: Type: text/plain, Size: 218 bytes --]

--
Problem reports:       http://cygwin.com/problems.html
FAQ:                   http://cygwin.com/faq/
Documentation:         http://cygwin.com/docs.html
Unsubscribe info:      http://cygwin.com/ml/#unsubscribe-simple

^ permalink raw reply	[flat|nested] 2+ messages in thread

* Re: Fwd: getcwd in Make's Test Scripts Causes Errors
  2013-07-09  5:35 ` Fwd: getcwd in Make's Test Scripts Causes Errors GJ
@ 2013-07-09  5:50   ` marco atzeri
  0 siblings, 0 replies; 2+ messages in thread
From: marco atzeri @ 2013-07-09  5:50 UTC (permalink / raw)
  To: cygwin

Il 7/9/2013 7:13 AM, GJ ha scritto:
> Hello,
>
> I'm trying to build Make-3.82 in Cygwin64 1.7.21-6 on Windows 8 x64.
> It appears to build just fine, but I can't run the tests.  I've tried
> running it with "make check", "perl run_make_tests.pl", and the latter
> in Window's own CMD.exe.  When a test fails, it produces the error
> "shell-init: error retrieving current directory: getcwd: cannot access
> parent directories: No error".
>
> Attached is a cygheck.out, the script I ran to try to build and test
> Make in "conf-make-inst.sh", (so it's easy to see how to reproduce the
> problem) and the output of the script in "build log.txt".  "build
> log.txt" is just the output of "conf-make-inst.sh".  It contains the
> output from the configure, make, and make check commands.
>
> I can't seem to find much information on this, or I don't have the
> expertise to understand the information out there on errors with
> getcwd and Cygwin.  Did I include all the information needed to be
> helpful?
>
> Thanks for your consideration.
>

why building something already available ?

$ make --version
GNU Make 3.82.90

have you checked the cygwin source package of make ?
Following the same road is likely easier.

Regards
Marco


--
Problem reports:       http://cygwin.com/problems.html
FAQ:                   http://cygwin.com/faq/
Documentation:         http://cygwin.com/docs.html
Unsubscribe info:      http://cygwin.com/ml/#unsubscribe-simple

^ permalink raw reply	[flat|nested] 2+ messages in thread

end of thread, other threads:[~2013-07-09  5:29 UTC | newest]

Thread overview: 2+ messages (download: mbox.gz / follow: Atom feed)
-- links below jump to the message on this page --
     [not found] <CAO9FYyF80O81hjwtOmZCOUEOYvxSF48aZcnj4cN5zdFTyJuV9Q@mail.gmail.com>
2013-07-09  5:35 ` Fwd: getcwd in Make's Test Scripts Causes Errors GJ
2013-07-09  5:50   ` marco atzeri

This is a public inbox, see mirroring instructions
for how to clone and mirror all data and code used for this inbox;
as well as URLs for read-only IMAP folder(s) and NNTP newsgroup(s).