public inbox for ecos-discuss@sourceware.org
 help / color / mirror / Atom feed
* [ECOS] Build library problem!
@ 2001-05-04  4:58 xinyin
  2001-05-04 11:47 ` Jonathan Larmour
  0 siblings, 1 reply; 2+ messages in thread
From: xinyin @ 2001-05-04  4:58 UTC (permalink / raw)
  To: ecos-discuss

[-- Warning: decoded text below may be mangled, UTF-8 assumed --]
[-- Attachment #1: Type: text/plain, Size: 1294 bytes --]

Hello,
  
Cygwin 1.3.1 environment on Windows 2000. Trying to develop eCos for 
an arm-elf target.

I have built the binutils, GCC, GDB, everything is ok. But when I 
start to build eCos with this tools, now I receive the following 
error information:

*** Process 2824 created "make -j1"
make -r -C hal/arm/arch/v1_3_1 headers
make[1]: Entering directory `/test/pid_build/hal/arm/arch/v1_3_1'
cp: cannot create regular file `//C/cygwin/test/pid_install/include/cyg/hal/arm_stub.h': No such file or directory
make[1]: *** [//C/cygwin/test/pid_install/include/cyg/hal/arm_stub.h] Error 1
make[1]: Leaving directory `/test/pid_build/hal/arm/arch/v1_3_1'
make: *** [headers] Error 2

I checked the directory and find out there is no cyg/hal/ in //C/cygwin/test/pid_install/include/, what can I do for this?



-----------------------------------------
Ãâ·Ñºº±¤°ü£¬ÇáËÉѧӢÓï
http://www.etang.com/texthanburg/index.htm
Ëý¹ØÐÄÄãµÄÎÂů
http://ad2.263.net/cgi-bin/advert/push/redirect.cgi?aid=2725
EtangÊý×ÖרÂôµê
http://www.etang.com/adclient/cncard/index.htm
ŮǿÈËÅúÅÐÊé
http://topic.etang.com/

^ permalink raw reply	[flat|nested] 2+ messages in thread

* Re: [ECOS] Build library problem!
  2001-05-04  4:58 [ECOS] Build library problem! xinyin
@ 2001-05-04 11:47 ` Jonathan Larmour
  0 siblings, 0 replies; 2+ messages in thread
From: Jonathan Larmour @ 2001-05-04 11:47 UTC (permalink / raw)
  To: xinyin; +Cc: ecos-discuss

xinyin wrote:
> 
> Hello,
> 
> Cygwin 1.3.1 environment on Windows 2000. Trying to develop eCos for
> an arm-elf target.
> 
> I have built the binutils, GCC, GDB, everything is ok. But when I
> start to build eCos with this tools, now I receive the following
> error information:
> 
> *** Process 2824 created "make -j1"
> make -r -C hal/arm/arch/v1_3_1 headers
> make[1]: Entering directory `/test/pid_build/hal/arm/arch/v1_3_1'
> cp: cannot create regular file `//C/cygwin/test/pid_install/include/cyg/hal/arm_stub.h': No such file or directory
> make[1]: *** [//C/cygwin/test/pid_install/include/cyg/hal/arm_stub.h] Error 1
> make[1]: Leaving directory `/test/pid_build/hal/arm/arch/v1_3_1'
> make: *** [headers] Error 2
> 
> I checked the directory and find out there is no cyg/hal/ in //C/cygwin/test/pid_install/include/, what can I do for this?

Does the file hal/arm/arch/v1_3_1/include/arm_stub.h exist in your source
repository?

What happens if you do:

mkdir -p //C/cygwin/test/pid_install/include/cyg/hal

from a cygwin bash prompt?

Jifl
-- 
Red Hat, Rustat House, Clifton Road, Cambridge, UK. Tel: +44 (1223) 271062
Maybe this world is another planet's Hell -Aldous Huxley || Opinions==mine

^ permalink raw reply	[flat|nested] 2+ messages in thread

end of thread, other threads:[~2001-05-04 11:47 UTC | newest]

Thread overview: 2+ messages (download: mbox.gz / follow: Atom feed)
-- links below jump to the message on this page --
2001-05-04  4:58 [ECOS] Build library problem! xinyin
2001-05-04 11:47 ` Jonathan Larmour

This is a public inbox, see mirroring instructions
for how to clone and mirror all data and code used for this inbox;
as well as URLs for read-only IMAP folder(s) and NNTP newsgroup(s).