public inbox for ecos-maintainers@sourceware.org
 help / color / mirror / Atom feed
From: raj <rajshekar@globaledgesoft.com>
To: ecos-maintainers@sources.redhat.com
Subject: problem building on Red-Linux9.o
Date: Wed, 23 Jun 2004 13:55:00 -0000	[thread overview]
Message-ID: <1087999323.27995.1.camel@rajshekar.ges> (raw)

[-- Attachment #1: Type: text/plain, Size: 633 bytes --]

Hi,
I am posting this message as I am facing a problem after building
eCos2.0 on RedHat 9.0.
I have all eCos stubs in $HOME/eCos-2.0 directory. I created a temporary
directory inside this directory and did "../configure". Then, a
Makefile  was created in that temporary directory. Then, I did "make
install" (with su previleges) followed by "make".


I am sending the result of this build-actions. There
you can find few of my system information also.
Please provide me the solutions about how to build
the same.

Thanking you.

Regards,
E. Rajshekhar Rao
SAN Lab,
Global Edge Software Limited,
Bangalore,
INDIA

Mobile:919886453311

[-- Attachment #2: BuildingResult.txt --]
[-- Type: text/plain, Size: 59498 bytes --]

[root@rajshekar temp]# ../configure --prefix=/usr/local/ecos
loading cache ./config.cache
checking host system type... i686-pc-linux-gnu
checking for a BSD compatible install... (cached) /usr/bin/install -c
checking whether build environment is sane... yes
checking whether make sets ${MAKE}... (cached) yes
checking for working aclocal... found
checking for working autoconf... found
checking for working automake... found
checking for working autoheader... found
checking for working makeinfo... found
checking whether to enable maintainer-specific portions of Makefiles... no
checking that a separate build tree is being used... yes
creating ./config.status
creating Makefile
configuring in tools/src
running /bin/sh ../../../tools/src/configure  --prefix=/usr/local/ecos --cache-file=../.././config.cache --srcdir=../../../tools/src
loading cache ../.././config.cache
checking host system type... i686-pc-linux-gnu
checking for a BSD compatible install... (cached) /usr/bin/install -c
checking whether build environment is sane... yes
checking whether make sets ${MAKE}... (cached) yes
checking for working aclocal... found
checking for working autoconf... found
checking for working automake... found
checking for working autoheader... found
checking for working makeinfo... found
checking whether to enable maintainer-specific portions of Makefiles... no
checking that a separate build tree is being used... yes
creating ./config.status
creating Makefile
configuring in infra
running /bin/sh ../../../../tools/src/infra/configure  --prefix=/usr/local/ecos --cache-file=../../.././config.cache --srcdir=../../../../tools/src/infra
loading cache ../../.././config.cache
checking that a separate build tree is being used... yes
checking host system type... i686-pc-linux-gnu
checking for a BSD compatible install... (cached) /usr/bin/install -c
checking whether build environment is sane... yes
checking whether make sets ${MAKE}... (cached) yes
checking for working aclocal... found
checking for working autoconf... found
checking for working automake... found
checking for working autoheader... found
checking for working makeinfo... found
checking whether to enable maintainer-specific portions of Makefiles... no
checking for gcc... (cached) gcc
checking whether the C compiler (gcc  ) works... yes
checking whether the C compiler (gcc  ) is a cross-compiler... no
checking whether we are using GNU C... (cached) yes
checking whether gcc accepts -g... (cached) yes
checking for c++... (cached) c++
checking whether the C++ compiler (c++  ) works... yes
checking whether the C++ compiler (c++  ) is a cross-compiler... no
checking whether we are using GNU C++... (cached) yes
checking whether c++ accepts -g... (cached) yes
checking for ranlib... (cached) ranlib
checking for object suffix... (cached) o
checking for Cygwin environment... (cached) no
checking for mingw32 environment... (cached) no
checking for executable suffix... (cached) no
checking for Visual C++... no
checking the default compiler flags... done
checking whether byte ordering is bigendian... (cached) no
checking for a 64 bit data type... (cached) long long
checking size of int *... (cached) 4
checking size of long... (cached) 4
checking for __PRETTY_FUNCTION__ support... (cached) yes
checking for mkstemp... (cached) yes
creating ./config.status
creating Makefile
creating testsuite/Makefile
creating hostinfra.h
hostinfra.h is unchanged
configuring in libcdl
running /bin/sh ../../../../tools/src/libcdl/configure  --prefix=/usr/local/ecos --cache-file=../../.././config.cache --srcdir=../../../../tools/src/libcdl
loading cache ../../.././config.cache
checking that a separate build tree is being used... yes
checking host system type... i686-pc-linux-gnu
checking for a BSD compatible install... (cached) /usr/bin/install -c
checking whether build environment is sane... yes
checking whether make sets ${MAKE}... (cached) yes
checking for working aclocal... found
checking for working autoconf... found
checking for working automake... found
checking for working autoheader... found
checking for working makeinfo... found
checking whether to enable maintainer-specific portions of Makefiles... no
checking for gcc... (cached) gcc
checking whether the C compiler (gcc  ) works... yes
checking whether the C compiler (gcc  ) is a cross-compiler... no
checking whether we are using GNU C... (cached) yes
checking whether gcc accepts -g... (cached) yes
checking for c++... (cached) c++
checking whether the C++ compiler (c++  ) works... yes
checking whether the C++ compiler (c++  ) is a cross-compiler... no
checking whether we are using GNU C++... (cached) yes
checking whether c++ accepts -g... (cached) yes
checking for ranlib... (cached) ranlib
checking for object suffix... (cached) o
checking for Cygwin environment... (cached) no
checking for mingw32 environment... (cached) no
checking for executable suffix... (cached) no
checking for Visual C++... no
checking the default compiler flags... done
checking for eCos host-side infrastructure... -I/home/raj/ecos-2.0/temp/tools/src/infra -L/home/raj/ecos-2.0/temp/tools/src/infra
checking for Tcl installation... -I/usr/include -L/usr/lib -ltcl8.3${TCL_DBGX}
creating ./config.status
creating Makefile
creating testsuite/Makefile
creating cdlconfig.h
cdlconfig.h is unchanged
configuring in tools/configtool/standalone/common
running /bin/sh ../../../../../../../tools/src/tools/configtool/standalone/common/configure  --prefix=/usr/local/ecos --cache-file=../../../../../.././config.cache --srcdir=../../../../../../../tools/src/tools/configtool/standalone/common
loading cache ../../../../../.././config.cache
checking that a separate build tree is being used... yes
checking host system type... i686-pc-linux-gnu
checking for a BSD compatible install... (cached) /usr/bin/install -c
checking whether build environment is sane... yes
checking whether make sets ${MAKE}... (cached) yes
checking for working aclocal... found
checking for working autoconf... found
checking for working automake... found
checking for working autoheader... found
checking for working makeinfo... found
checking whether to enable maintainer-specific portions of Makefiles... no
checking for gcc... (cached) gcc
checking whether the C compiler (gcc  ) works... yes
checking whether the C compiler (gcc  ) is a cross-compiler... no
checking whether we are using GNU C... (cached) yes
checking whether gcc accepts -g... (cached) yes
checking for c++... (cached) c++
checking whether the C++ compiler (c++  ) works... yes
checking whether the C++ compiler (c++  ) is a cross-compiler... no
checking whether we are using GNU C++... (cached) yes
checking whether c++ accepts -g... (cached) yes
checking for object suffix... (cached) o
checking for Cygwin environment... (cached) no
checking for mingw32 environment... (cached) no
checking for executable suffix... (cached) no
checking for Visual C++... no
checking the default compiler flags... done
checking for libcdl... -I/home/raj/ecos-2.0/tools/src/libcdl -L/home/raj/ecos-2.0/temp/tools/src/libcdl
checking for eCos host-side infrastructure... -I/home/raj/ecos-2.0/temp/tools/src/infra -L/home/raj/ecos-2.0/temp/tools/src/infra
checking for Tcl installation... -I/usr/include -L/usr/lib -ltcl8.3${TCL_DBGX}
creating ./config.status
creating Makefile
configuring in packages/devs/watchdog/synth/v2_0/host
running /bin/sh ../../../../../../../packages/devs/watchdog/synth/v2_0/host/configure  --prefix=/usr/local/ecos --cache-file=../../../../../.././config.cache --srcdir=../../../../../../../packages/devs/watchdog/synth/v2_0/host
loading cache ../../../../../.././config.cache
checking that a separate build tree is being used... yes
checking host system type... i686-pc-linux-gnu
checking for a BSD compatible install... (cached) /usr/bin/install -c
checking whether build environment is sane... yes
checking whether make sets ${MAKE}... (cached) yes
checking for working aclocal... found
checking for working autoconf... found
checking for working automake... found
checking for working autoheader... found
checking for working makeinfo... found
checking whether to enable maintainer-specific portions of Makefiles... no
creating ./config.status
creating Makefile
configuring in packages/hal/synth/arch/v2_0/host
running /bin/sh ../../../../../../../packages/hal/synth/arch/v2_0/host/configure  --prefix=/usr/local/ecos --cache-file=../../../../../.././config.cache --srcdir=../../../../../../../packages/hal/synth/arch/v2_0/host
loading cache ../../../../../.././config.cache
checking that a separate build tree is being used... yes
checking host system type... i686-pc-linux-gnu
checking for a BSD compatible install... (cached) /usr/bin/install -c
checking whether build environment is sane... yes
checking whether make sets ${MAKE}... (cached) yes
checking for working aclocal... found
checking for working autoconf... found
checking for working automake... found
checking for working autoheader... found
checking for working makeinfo... found
checking whether to enable maintainer-specific portions of Makefiles... no
checking for gcc... (cached) gcc
checking whether the C compiler (gcc  ) works... yes
checking whether the C compiler (gcc  ) is a cross-compiler... no
checking whether we are using GNU C... (cached) yes
checking whether gcc accepts -g... (cached) yes
checking for c++... (cached) c++
checking whether the C++ compiler (c++  ) works... yes
checking whether the C++ compiler (c++  ) is a cross-compiler... no
checking whether we are using GNU C++... (cached) yes
checking whether c++ accepts -g... (cached) yes
checking for object suffix... (cached) o
checking for Cygwin environment... (cached) no
checking for mingw32 environment... (cached) no
checking for executable suffix... (cached) no
checking for Visual C++... no
checking the default compiler flags... done
checking for Tcl installation... -I/usr/include -L/usr/lib -ltcl8.3${TCL_DBGX}
creating ./config.status
creating Makefile
configuring in packages/io/usb/slave/v2_0/host
running /bin/sh ../../../../../../../packages/io/usb/slave/v2_0/host/configure  --prefix=/usr/local/ecos --cache-file=../../../../../.././config.cache --srcdir=../../../../../../../packages/io/usb/slave/v2_0/host
loading cache ../../../../../.././config.cache
checking that a separate build tree is being used... yes
checking host system type... i686-pc-linux-gnu
checking for a BSD compatible install... (cached) /usr/bin/install -c
checking whether build environment is sane... yes
checking whether make sets ${MAKE}... (cached) yes
checking for working aclocal... found
checking for working autoconf... found
checking for working automake... found
checking for working autoheader... found
checking for working makeinfo... found
checking whether to enable maintainer-specific portions of Makefiles... no
checking for gcc... (cached) gcc
checking whether the C compiler (gcc  ) works... yes
checking whether the C compiler (gcc  ) is a cross-compiler... no
checking whether we are using GNU C... (cached) yes
checking whether gcc accepts -g... (cached) yes
checking for c++... (cached) c++
checking whether the C++ compiler (c++  ) works... yes
checking whether the C++ compiler (c++  ) is a cross-compiler... no
checking whether we are using GNU C++... (cached) yes
checking whether c++ accepts -g... (cached) yes
checking whether ln -s works... (cached) yes
checking for object suffix... (cached) o
checking for Cygwin environment... (cached) no
checking for mingw32 environment... (cached) no
checking for executable suffix... (cached) no
checking for Visual C++... no
checking the default compiler flags... done
checking for Tcl installation... -I/usr/include -L/usr/lib -ltcl8.3${TCL_DBGX}
checking how to run the C preprocessor... (cached) gcc -E
checking for linux/usb.h... (cached) yes
checking for linux/usbdevice_fs.h... (cached) yes
creating ./config.status
creating Makefile
configuring in packages/devs/eth/synth/ecosynth/v2_0/host
running /bin/sh ../../../../../../../../packages/devs/eth/synth/ecosynth/v2_0/host/configure  --prefix=/usr/local/ecos --cache-file=../../../../../../.././config.cache --srcdir=../../../../../../../../packages/devs/eth/synth/ecosynth/v2_0/host
loading cache ../../../../../../.././config.cache
checking that a separate build tree is being used... yes
checking host system type... i686-pc-linux-gnu
checking for a BSD compatible install... (cached) /usr/bin/install -c
checking whether build environment is sane... yes
checking whether make sets ${MAKE}... (cached) yes
checking for working aclocal... found
checking for working autoconf... found
checking for working automake... found
checking for working autoheader... found
checking for working makeinfo... found
checking whether to enable maintainer-specific portions of Makefiles... no
checking for gcc... (cached) gcc
checking whether the C compiler (gcc  ) works... yes
checking whether the C compiler (gcc  ) is a cross-compiler... no
checking whether we are using GNU C... (cached) yes
checking whether gcc accepts -g... (cached) yes
checking for c++... (cached) c++
checking whether the C++ compiler (c++  ) works... yes
checking whether the C++ compiler (c++  ) is a cross-compiler... no
checking whether we are using GNU C++... (cached) yes
checking whether c++ accepts -g... (cached) yes
checking for object suffix... (cached) o
checking for Cygwin environment... (cached) no
checking for mingw32 environment... (cached) no
checking for executable suffix... (cached) no
checking for Visual C++... no
checking the default compiler flags... done
checking how to run the C preprocessor... (cached) gcc -E
checking for linux/if_tun.h... (cached) yes
creating ./config.status
creating Makefile
[root@rajshekar temp]# make
Making all in tools/src
make[1]: Entering directory `/home/raj/ecos-2.0/temp/tools/src'
Making all in infra
make[2]: Entering directory `/home/raj/ecos-2.0/temp/tools/src/infra'
make  all-recursive
make[3]: Entering directory `/home/raj/ecos-2.0/temp/tools/src/infra'
Making all in testsuite
make[4]: Entering directory `/home/raj/ecos-2.0/temp/tools/src/infra/testsuite'
make[4]: Nothing to be done for `all'.
make[4]: Leaving directory `/home/raj/ecos-2.0/temp/tools/src/infra/testsuite'
make[4]: Entering directory `/home/raj/ecos-2.0/temp/tools/src/infra'
c++ -DHAVE_CONFIG_H -I. -I../../../../tools/src/infra -I.    -pipe -Wall -Wpointer-arith -Wbad-function-cast -Wcast-qual -Wstrict-prototypes -Wmissing-prototypes -Wnested-externs -Woverloaded-virtual -O0  -c ../../../../tools/src/infra/assert.cxx
c++ -DHAVE_CONFIG_H -I. -I../../../../tools/src/infra -I.    -pipe -Wall -Wpointer-arith -Wbad-function-cast -Wcast-qual -Wstrict-prototypes -Wmissing-prototypes -Wnested-externs -Woverloaded-virtual -O0  -c ../../../../tools/src/infra/trace.cxx
c++ -DHAVE_CONFIG_H -I. -I../../../../tools/src/infra -I.    -pipe -Wall -Wpointer-arith -Wbad-function-cast -Wcast-qual -Wstrict-prototypes -Wmissing-prototypes -Wnested-externs -Woverloaded-virtual -O0  -c ../../../../tools/src/infra/checkdata.cxx
c++ -DHAVE_CONFIG_H -I. -I../../../../tools/src/infra -I.    -pipe -Wall -Wpointer-arith -Wbad-function-cast -Wcast-qual -Wstrict-prototypes -Wmissing-prototypes -Wnested-externs -Woverloaded-virtual -O0  -c ../../../../tools/src/infra/testcase.cxx
rm -f libcyginfra.a
ar cru libcyginfra.a assert.o trace.o checkdata.o testcase.o
ranlib libcyginfra.a
make[4]: Leaving directory `/home/raj/ecos-2.0/temp/tools/src/infra'
make[3]: Leaving directory `/home/raj/ecos-2.0/temp/tools/src/infra'
make[2]: Leaving directory `/home/raj/ecos-2.0/temp/tools/src/infra'
Making all in libcdl
make[2]: Entering directory `/home/raj/ecos-2.0/temp/tools/src/libcdl'
make  all-recursive
make[3]: Entering directory `/home/raj/ecos-2.0/temp/tools/src/libcdl'
Making all in testsuite
make[4]: Entering directory `/home/raj/ecos-2.0/temp/tools/src/libcdl/testsuite'
make[4]: Nothing to be done for `all'.
make[4]: Leaving directory `/home/raj/ecos-2.0/temp/tools/src/libcdl/testsuite'
make[4]: Entering directory `/home/raj/ecos-2.0/temp/tools/src/libcdl'
c++ -DHAVE_CONFIG_H -I. -I../../../../tools/src/libcdl -I. -I/home/raj/ecos-2.0/temp/tools/src/infra   -pipe -Wall -Wpointer-arith -Wbad-function-cast -Wcast-qual -Wstrict-prototypes -Wmissing-prototypes -Wnested-externs -Woverloaded-virtual -O0  -c
../../../../tools/src/libcdl/interp.cxx
In file included from ../../../../tools/src/libcdl/interp.cxx:61:
../../../../tools/src/libcdl/cdlcore.hxx:3470: warning: `virtual void
   CdlNodeBody::save(CdlInterpreterBody*, Tcl_Channel_*, int, bool)' was hidden
../../../../tools/src/libcdl/cdlcore.hxx:4283: warning:   by `void
   CdlValuableBody::save(CdlInterpreterBody*, Tcl_Channel_*, int, bool, bool)'
c++ -DHAVE_CONFIG_H -I. -I../../../../tools/src/libcdl -I. -I/home/raj/ecos-2.0/temp/tools/src/infra   -pipe -Wall -Wpointer-arith -Wbad-function-cast -Wcast-qual -Wstrict-prototypes -Wmissing-prototypes -Wnested-externs -Woverloaded-virtual -O0  -c
../../../../tools/src/libcdl/expr.cxx
In file included from ../../../../tools/src/libcdl/expr.cxx:59:
../../../../tools/src/libcdl/cdlcore.hxx:3470: warning: `virtual void
   CdlNodeBody::save(CdlInterpreterBody*, Tcl_Channel_*, int, bool)' was hidden
../../../../tools/src/libcdl/cdlcore.hxx:4283: warning:   by `void
   CdlValuableBody::save(CdlInterpreterBody*, Tcl_Channel_*, int, bool, bool)'
c++ -DHAVE_CONFIG_H -I. -I../../../../tools/src/libcdl -I. -I/home/raj/ecos-2.0/temp/tools/src/infra   -pipe -Wall -Wpointer-arith -Wbad-function-cast -Wcast-qual -Wstrict-prototypes -Wmissing-prototypes -Wnested-externs -Woverloaded-virtual -O0  -c
../../../../tools/src/libcdl/func.cxx
In file included from ../../../../tools/src/libcdl/func.cxx:59:
../../../../tools/src/libcdl/cdlcore.hxx:3470: warning: `virtual void
   CdlNodeBody::save(CdlInterpreterBody*, Tcl_Channel_*, int, bool)' was hidden
../../../../tools/src/libcdl/cdlcore.hxx:4283: warning:   by `void
   CdlValuableBody::save(CdlInterpreterBody*, Tcl_Channel_*, int, bool, bool)'
c++ -DHAVE_CONFIG_H -I. -I../../../../tools/src/libcdl -I. -I/home/raj/ecos-2.0/temp/tools/src/infra   -pipe -Wall -Wpointer-arith -Wbad-function-cast -Wcast-qual -Wstrict-prototypes -Wmissing-prototypes -Wnested-externs -Woverloaded-virtual -O0  -c
../../../../tools/src/libcdl/refer.cxx
In file included from ../../../../tools/src/libcdl/refer.cxx:59:
../../../../tools/src/libcdl/cdlcore.hxx:3470: warning: `virtual void
   CdlNodeBody::save(CdlInterpreterBody*, Tcl_Channel_*, int, bool)' was hidden
../../../../tools/src/libcdl/cdlcore.hxx:4283: warning:   by `void
   CdlValuableBody::save(CdlInterpreterBody*, Tcl_Channel_*, int, bool, bool)'
c++ -DHAVE_CONFIG_H -I. -I../../../../tools/src/libcdl -I. -I/home/raj/ecos-2.0/temp/tools/src/infra   -pipe -Wall -Wpointer-arith -Wbad-function-cast -Wcast-qual -Wstrict-prototypes -Wmissing-prototypes -Wnested-externs -Woverloaded-virtual -O0  -c
../../../../tools/src/libcdl/cdlmisc.cxx
In file included from ../../../../tools/src/libcdl/cdlmisc.cxx:59:
../../../../tools/src/libcdl/cdlcore.hxx:3470: warning: `virtual void
   CdlNodeBody::save(CdlInterpreterBody*, Tcl_Channel_*, int, bool)' was hidden
../../../../tools/src/libcdl/cdlcore.hxx:4283: warning:   by `void
   CdlValuableBody::save(CdlInterpreterBody*, Tcl_Channel_*, int, bool, bool)'
c++ -DHAVE_CONFIG_H -I. -I../../../../tools/src/libcdl -I. -I/home/raj/ecos-2.0/temp/tools/src/infra   -pipe -Wall -Wpointer-arith -Wbad-function-cast -Wcast-qual -Wstrict-prototypes -Wmissing-prototypes -Wnested-externs -Woverloaded-virtual -O0  -c
../../../../tools/src/libcdl/conflict.cxx
In file included from ../../../../tools/src/libcdl/conflict.cxx:60:
../../../../tools/src/libcdl/cdlcore.hxx:3470: warning: `virtual void
   CdlNodeBody::save(CdlInterpreterBody*, Tcl_Channel_*, int, bool)' was hidden
../../../../tools/src/libcdl/cdlcore.hxx:4283: warning:   by `void
   CdlValuableBody::save(CdlInterpreterBody*, Tcl_Channel_*, int, bool, bool)'
c++ -DHAVE_CONFIG_H -I. -I../../../../tools/src/libcdl -I. -I/home/raj/ecos-2.0/temp/tools/src/infra   -pipe -Wall -Wpointer-arith -Wbad-function-cast -Wcast-qual -Wstrict-prototypes -Wmissing-prototypes -Wnested-externs -Woverloaded-virtual -O0  -c
../../../../tools/src/libcdl/property.cxx
In file included from ../../../../tools/src/libcdl/property.cxx:64:
../../../../tools/src/libcdl/cdlcore.hxx:3470: warning: `virtual void
   CdlNodeBody::save(CdlInterpreterBody*, Tcl_Channel_*, int, bool)' was hidden
../../../../tools/src/libcdl/cdlcore.hxx:4283: warning:   by `void
   CdlValuableBody::save(CdlInterpreterBody*, Tcl_Channel_*, int, bool, bool)'
c++ -DHAVE_CONFIG_H -I. -I../../../../tools/src/libcdl -I. -I/home/raj/ecos-2.0/temp/tools/src/infra   -pipe -Wall -Wpointer-arith -Wbad-function-cast -Wcast-qual -Wstrict-prototypes -Wmissing-prototypes -Wnested-externs -Woverloaded-virtual -O0  -c
../../../../tools/src/libcdl/parse.cxx
In file included from ../../../../tools/src/libcdl/parse.cxx:60:
../../../../tools/src/libcdl/cdlcore.hxx:3470: warning: `virtual void
   CdlNodeBody::save(CdlInterpreterBody*, Tcl_Channel_*, int, bool)' was hidden
../../../../tools/src/libcdl/cdlcore.hxx:4283: warning:   by `void
   CdlValuableBody::save(CdlInterpreterBody*, Tcl_Channel_*, int, bool, bool)'
c++ -DHAVE_CONFIG_H -I. -I../../../../tools/src/libcdl -I. -I/home/raj/ecos-2.0/temp/tools/src/infra   -pipe -Wall -Wpointer-arith -Wbad-function-cast -Wcast-qual -Wstrict-prototypes -Wmissing-prototypes -Wnested-externs -Woverloaded-virtual -O0  -c
../../../../tools/src/libcdl/base.cxx
In file included from ../../../../tools/src/libcdl/base.cxx:63:
../../../../tools/src/libcdl/cdlcore.hxx:3470: warning: `virtual void
   CdlNodeBody::save(CdlInterpreterBody*, Tcl_Channel_*, int, bool)' was hidden
../../../../tools/src/libcdl/cdlcore.hxx:4283: warning:   by `void
   CdlValuableBody::save(CdlInterpreterBody*, Tcl_Channel_*, int, bool, bool)'
c++ -DHAVE_CONFIG_H -I. -I../../../../tools/src/libcdl -I. -I/home/raj/ecos-2.0/temp/tools/src/infra   -pipe -Wall -Wpointer-arith -Wbad-function-cast -Wcast-qual -Wstrict-prototypes -Wmissing-prototypes -Wnested-externs -Woverloaded-virtual -O0  -c
../../../../tools/src/libcdl/value.cxx
In file included from ../../../../tools/src/libcdl/value.cxx:60:
../../../../tools/src/libcdl/cdlcore.hxx:3470: warning: `virtual void
   CdlNodeBody::save(CdlInterpreterBody*, Tcl_Channel_*, int, bool)' was hidden
../../../../tools/src/libcdl/cdlcore.hxx:4283: warning:   by `void
   CdlValuableBody::save(CdlInterpreterBody*, Tcl_Channel_*, int, bool, bool)'
c++ -DHAVE_CONFIG_H -I. -I../../../../tools/src/libcdl -I. -I/home/raj/ecos-2.0/temp/tools/src/infra   -pipe -Wall -Wpointer-arith -Wbad-function-cast -Wcast-qual -Wstrict-prototypes -Wmissing-prototypes -Wnested-externs -Woverloaded-virtual -O0  -c
../../../../tools/src/libcdl/build.cxx
In file included from ../../../../tools/src/libcdl/build.cxx:59:
../../../../tools/src/libcdl/cdlcore.hxx:3470: warning: `virtual void
   CdlNodeBody::save(CdlInterpreterBody*, Tcl_Channel_*, int, bool)' was hidden
../../../../tools/src/libcdl/cdlcore.hxx:4283: warning:   by `void
   CdlValuableBody::save(CdlInterpreterBody*, Tcl_Channel_*, int, bool, bool)'
c++ -DHAVE_CONFIG_H -I. -I../../../../tools/src/libcdl -I. -I/home/raj/ecos-2.0/temp/tools/src/infra   -pipe -Wall -Wpointer-arith -Wbad-function-cast -Wcast-qual -Wstrict-prototypes -Wmissing-prototypes -Wnested-externs -Woverloaded-virtual -O0  -c
../../../../tools/src/libcdl/dialog.cxx
In file included from ../../../../tools/src/libcdl/dialog.cxx:60:
../../../../tools/src/libcdl/cdlcore.hxx:3470: warning: `virtual void
   CdlNodeBody::save(CdlInterpreterBody*, Tcl_Channel_*, int, bool)' was hidden
../../../../tools/src/libcdl/cdlcore.hxx:4283: warning:   by `void
   CdlValuableBody::save(CdlInterpreterBody*, Tcl_Channel_*, int, bool, bool)'
c++ -DHAVE_CONFIG_H -I. -I../../../../tools/src/libcdl -I. -I/home/raj/ecos-2.0/temp/tools/src/infra   -pipe -Wall -Wpointer-arith -Wbad-function-cast -Wcast-qual -Wstrict-prototypes -Wmissing-prototypes -Wnested-externs -Woverloaded-virtual -O0  -c
../../../../tools/src/libcdl/wizard.cxx
In file included from ../../../../tools/src/libcdl/wizard.cxx:60:
../../../../tools/src/libcdl/cdlcore.hxx:3470: warning: `virtual void
   CdlNodeBody::save(CdlInterpreterBody*, Tcl_Channel_*, int, bool)' was hidden
../../../../tools/src/libcdl/cdlcore.hxx:4283: warning:   by `void
   CdlValuableBody::save(CdlInterpreterBody*, Tcl_Channel_*, int, bool, bool)'
c++ -DHAVE_CONFIG_H -I. -I../../../../tools/src/libcdl -I. -I/home/raj/ecos-2.0/temp/tools/src/infra   -pipe -Wall -Wpointer-arith -Wbad-function-cast -Wcast-qual -Wstrict-prototypes -Wmissing-prototypes -Wnested-externs -Woverloaded-virtual -O0  -c
../../../../tools/src/libcdl/interface.cxx
In file included from ../../../../tools/src/libcdl/interface.cxx:60:
../../../../tools/src/libcdl/cdlcore.hxx:3470: warning: `virtual void
   CdlNodeBody::save(CdlInterpreterBody*, Tcl_Channel_*, int, bool)' was hidden
../../../../tools/src/libcdl/cdlcore.hxx:4283: warning:   by `void
   CdlValuableBody::save(CdlInterpreterBody*, Tcl_Channel_*, int, bool, bool)'
c++ -DHAVE_CONFIG_H -I. -I../../../../tools/src/libcdl -I. -I/home/raj/ecos-2.0/temp/tools/src/infra   -pipe -Wall -Wpointer-arith -Wbad-function-cast -Wcast-qual -Wstrict-prototypes -Wmissing-prototypes -Wnested-externs -Woverloaded-virtual -O0  -c
../../../../tools/src/libcdl/transact.cxx
In file included from ../../../../tools/src/libcdl/transact.cxx:59:
../../../../tools/src/libcdl/cdlcore.hxx:3470: warning: `virtual void
   CdlNodeBody::save(CdlInterpreterBody*, Tcl_Channel_*, int, bool)' was hidden
../../../../tools/src/libcdl/cdlcore.hxx:4283: warning:   by `void
   CdlValuableBody::save(CdlInterpreterBody*, Tcl_Channel_*, int, bool, bool)'
c++ -DHAVE_CONFIG_H -I. -I../../../../tools/src/libcdl -I. -I/home/raj/ecos-2.0/temp/tools/src/infra   -pipe -Wall -Wpointer-arith -Wbad-function-cast -Wcast-qual -Wstrict-prototypes -Wmissing-prototypes -Wnested-externs -Woverloaded-virtual -O0  -c
../../../../tools/src/libcdl/infer.cxx
In file included from ../../../../tools/src/libcdl/infer.cxx:59:
../../../../tools/src/libcdl/cdlcore.hxx:3470: warning: `virtual void
   CdlNodeBody::save(CdlInterpreterBody*, Tcl_Channel_*, int, bool)' was hidden
../../../../tools/src/libcdl/cdlcore.hxx:4283: warning:   by `void
   CdlValuableBody::save(CdlInterpreterBody*, Tcl_Channel_*, int, bool, bool)'
c++ -DHAVE_CONFIG_H -I. -I../../../../tools/src/libcdl -I. -I/home/raj/ecos-2.0/temp/tools/src/infra   -pipe -Wall -Wpointer-arith -Wbad-function-cast -Wcast-qual -Wstrict-prototypes -Wmissing-prototypes -Wnested-externs -Woverloaded-virtual -O0  -c
../../../../tools/src/libcdl/database.cxx
In file included from ../../../../tools/src/libcdl/cdl.hxx:58,
                 from ../../../../tools/src/libcdl/database.cxx:62:
../../../../tools/src/libcdl/cdlcore.hxx:3470: warning: `virtual void
   CdlNodeBody::save(CdlInterpreterBody*, Tcl_Channel_*, int, bool)' was hidden
../../../../tools/src/libcdl/cdlcore.hxx:4283: warning:   by `void
   CdlValuableBody::save(CdlInterpreterBody*, Tcl_Channel_*, int, bool, bool)'
c++ -DHAVE_CONFIG_H -I. -I../../../../tools/src/libcdl -I. -I/home/raj/ecos-2.0/temp/tools/src/infra   -pipe -Wall -Wpointer-arith -Wbad-function-cast -Wcast-qual -Wstrict-prototypes -Wmissing-prototypes -Wnested-externs -Woverloaded-virtual -O0  -c
../../../../tools/src/libcdl/config.cxx
In file included from ../../../../tools/src/libcdl/cdl.hxx:58,
                 from ../../../../tools/src/libcdl/config.cxx:60:
../../../../tools/src/libcdl/cdlcore.hxx:3470: warning: `virtual void
   CdlNodeBody::save(CdlInterpreterBody*, Tcl_Channel_*, int, bool)' was hidden
../../../../tools/src/libcdl/cdlcore.hxx:4283: warning:   by `void
   CdlValuableBody::save(CdlInterpreterBody*, Tcl_Channel_*, int, bool, bool)'
c++ -DHAVE_CONFIG_H -I. -I../../../../tools/src/libcdl -I. -I/home/raj/ecos-2.0/temp/tools/src/infra   -pipe -Wall -Wpointer-arith -Wbad-function-cast -Wcast-qual -Wstrict-prototypes -Wmissing-prototypes -Wnested-externs -Woverloaded-virtual -O0  -c
../../../../tools/src/libcdl/package.cxx
In file included from ../../../../tools/src/libcdl/cdl.hxx:58,
                 from ../../../../tools/src/libcdl/package.cxx:60:
../../../../tools/src/libcdl/cdlcore.hxx:3470: warning: `virtual void
   CdlNodeBody::save(CdlInterpreterBody*, Tcl_Channel_*, int, bool)' was hidden
../../../../tools/src/libcdl/cdlcore.hxx:4283: warning:   by `void
   CdlValuableBody::save(CdlInterpreterBody*, Tcl_Channel_*, int, bool, bool)'
c++ -DHAVE_CONFIG_H -I. -I../../../../tools/src/libcdl -I. -I/home/raj/ecos-2.0/temp/tools/src/infra   -pipe -Wall -Wpointer-arith -Wbad-function-cast -Wcast-qual -Wstrict-prototypes -Wmissing-prototypes -Wnested-externs -Woverloaded-virtual -O0  -c
../../../../tools/src/libcdl/component.cxx
In file included from ../../../../tools/src/libcdl/cdl.hxx:58,
                 from ../../../../tools/src/libcdl/component.cxx:60:
../../../../tools/src/libcdl/cdlcore.hxx:3470: warning: `virtual void
   CdlNodeBody::save(CdlInterpreterBody*, Tcl_Channel_*, int, bool)' was hidden
../../../../tools/src/libcdl/cdlcore.hxx:4283: warning:   by `void
   CdlValuableBody::save(CdlInterpreterBody*, Tcl_Channel_*, int, bool, bool)'
c++ -DHAVE_CONFIG_H -I. -I../../../../tools/src/libcdl -I. -I/home/raj/ecos-2.0/temp/tools/src/infra   -pipe -Wall -Wpointer-arith -Wbad-function-cast -Wcast-qual -Wstrict-prototypes -Wmissing-prototypes -Wnested-externs -Woverloaded-virtual -O0  -c
../../../../tools/src/libcdl/option.cxx
In file included from ../../../../tools/src/libcdl/cdl.hxx:58,
                 from ../../../../tools/src/libcdl/option.cxx:60:
../../../../tools/src/libcdl/cdlcore.hxx:3470: warning: `virtual void
   CdlNodeBody::save(CdlInterpreterBody*, Tcl_Channel_*, int, bool)' was hidden
../../../../tools/src/libcdl/cdlcore.hxx:4283: warning:   by `void
   CdlValuableBody::save(CdlInterpreterBody*, Tcl_Channel_*, int, bool, bool)'
rm -f libcdl.a
ar cru libcdl.a interp.o expr.o func.o refer.o cdlmisc.o conflict.o property.o parse.o base.o value.o build.o dialog.o wizard.o interface.o transact.o infer.o database.o config.o package.o component.o option.o
ranlib libcdl.a
make[4]: Leaving directory `/home/raj/ecos-2.0/temp/tools/src/libcdl'
make[3]: Leaving directory `/home/raj/ecos-2.0/temp/tools/src/libcdl'
make[2]: Leaving directory `/home/raj/ecos-2.0/temp/tools/src/libcdl'
Making all in tools/configtool/standalone/common
make[2]: Entering directory `/home/raj/ecos-2.0/temp/tools/src/tools/configtool/standalone/common'
make[3]: Entering directory `/home/raj/ecos-2.0/temp/tools/src/tools/configtool/standalone/common'
c++ -DPACKAGE=\"ecosconfig\" -DVERSION=\"0.1\"  -I. -I../../../../../../../tools/src/tools/configtool/standalone/common  -I/home/raj/ecos-2.0/tools/src/libcdl -I/home/raj/ecos-2.0/temp/tools/src/infra -I../../../../../../../tools/src/tools/configtool/standalone/common/../../common/common   -pipe -Wall -Wpointer-arith -Wbad-function-cast -Wcast-qual -Wstrict-prototypes -Wmissing-prototypes -Wnested-externs -Woverloaded-virtual -O0  -c ../../../../../../../tools/src/tools/configtool/standalone/common/ecosconfig.cxx
In file included from /home/raj/ecos-2.0/tools/src/libcdl/cdl.hxx:58,
                 from ../../../../../../../tools/src/tools/configtool/standalone/common/cdl_exec.hxx:25,
                 from ../../../../../../../tools/src/tools/configtool/standalone/common/ecosconfig.cxx:50:
/home/raj/ecos-2.0/tools/src/libcdl/cdlcore.hxx:3470: warning: `virtual void
   CdlNodeBody::save(CdlInterpreterBody*, Tcl_Channel_*, int, bool)' was hidden
/home/raj/ecos-2.0/tools/src/libcdl/cdlcore.hxx:4283: warning:   by `void
   CdlValuableBody::save(CdlInterpreterBody*, Tcl_Channel_*, int, bool, bool)'
c++ -DPACKAGE=\"ecosconfig\" -DVERSION=\"0.1\"  -I. -I../../../../../../../tools/src/tools/configtool/standalone/common  -I/home/raj/ecos-2.0/tools/src/libcdl -I/home/raj/ecos-2.0/temp/tools/src/infra -I../../../../../../../tools/src/tools/configtool/standalone/common/../../common/common   -pipe -Wall -Wpointer-arith -Wbad-function-cast -Wcast-qual -Wstrict-prototypes -Wmissing-prototypes -Wnested-externs -Woverloaded-virtual -O0  -c ../../../../../../../tools/src/tools/configtool/standalone/common/cdl_exec.cxx
In file included from /home/raj/ecos-2.0/tools/src/libcdl/cdl.hxx:58,
                 from ../../../../../../../tools/src/tools/configtool/common/common/build.hxx:25,
                 from ../../../../../../../tools/src/tools/configtool/standalone/common/cdl_exec.cxx:52:
/home/raj/ecos-2.0/tools/src/libcdl/cdlcore.hxx:3470: warning: `virtual void
   CdlNodeBody::save(CdlInterpreterBody*, Tcl_Channel_*, int, bool)' was hidden
/home/raj/ecos-2.0/tools/src/libcdl/cdlcore.hxx:4283: warning:   by `void
   CdlValuableBody::save(CdlInterpreterBody*, Tcl_Channel_*, int, bool, bool)'
c++ -DPACKAGE=\"ecosconfig\" -DVERSION=\"0.1\"  -I. -I../../../../../../../tools/src/tools/configtool/standalone/common  -I/home/raj/ecos-2.0/tools/src/libcdl -I/home/raj/ecos-2.0/temp/tools/src/infra -I../../../../../../../tools/src/tools/configtool/standalone/common/../../common/common   -pipe -Wall -Wpointer-arith -Wbad-function-cast -Wcast-qual -Wstrict-prototypes -Wmissing-prototypes -Wnested-externs -Woverloaded-virtual -O0  -c build.cxx
In file included from /home/raj/ecos-2.0/tools/src/libcdl/cdl.hxx:58,
                 from ../../../../../../../tools/src/tools/configtool/common/common/flags.hxx:25,
                 from build.cxx:56:
/home/raj/ecos-2.0/tools/src/libcdl/cdlcore.hxx:3470: warning: `virtual void
   CdlNodeBody::save(CdlInterpreterBody*, Tcl_Channel_*, int, bool)' was hidden
/home/raj/ecos-2.0/tools/src/libcdl/cdlcore.hxx:4283: warning:   by `void
   CdlValuableBody::save(CdlInterpreterBody*, Tcl_Channel_*, int, bool, bool)'
build.cxx:107: warning: `void path_to_vector(std::basic_string<char,
   std::char_traits<char>, std::allocator<char> >, std::vector<std::string,
   std::allocator<std::string> >&)' defined but not used
c++ -DPACKAGE=\"ecosconfig\" -DVERSION=\"0.1\"  -I. -I../../../../../../../tools/src/tools/configtool/standalone/common  -I/home/raj/ecos-2.0/tools/src/libcdl -I/home/raj/ecos-2.0/temp/tools/src/infra -I../../../../../../../tools/src/tools/configtool/standalone/common/../../common/common   -pipe -Wall -Wpointer-arith -Wbad-function-cast -Wcast-qual -Wstrict-prototypes -Wmissing-prototypes -Wnested-externs -Woverloaded-virtual -O0  -c flags.cxx
In file included from /home/raj/ecos-2.0/tools/src/libcdl/cdl.hxx:58,
                 from ../../../../../../../tools/src/tools/configtool/common/common/flags.hxx:25,
                 from flags.cxx:41:
/home/raj/ecos-2.0/tools/src/libcdl/cdlcore.hxx:3470: warning: `virtual void
   CdlNodeBody::save(CdlInterpreterBody*, Tcl_Channel_*, int, bool)' was hidden
/home/raj/ecos-2.0/tools/src/libcdl/cdlcore.hxx:4283: warning:   by `void
   CdlValuableBody::save(CdlInterpreterBody*, Tcl_Channel_*, int, bool, bool)'
c++ -pipe -Wall -Wpointer-arith -Wbad-function-cast -Wcast-qual -Wstrict-prototypes -Wmissing-prototypes -Wnested-externs -Woverloaded-virtual -O0   -o ecosconfig  ecosconfig.o cdl_exec.o build.o flags.o  -lcdl -lcyginfra -L/usr/lib -ltcl8.3  -L/home/raj/ecos-2.0/temp/tools/src/libcdl -L/home/raj/ecos-2.0/temp/tools/src/infra
make[3]: Leaving directory `/home/raj/ecos-2.0/temp/tools/src/tools/configtool/standalone/common'
make[2]: Leaving directory `/home/raj/ecos-2.0/temp/tools/src/tools/configtool/standalone/common'
make[2]: Entering directory `/home/raj/ecos-2.0/temp/tools/src'
make[2]: Nothing to be done for `all-am'.
make[2]: Leaving directory `/home/raj/ecos-2.0/temp/tools/src'
make[1]: Leaving directory `/home/raj/ecos-2.0/temp/tools/src'
Making all in packages/devs/watchdog/synth/v2_0/host
make[1]: Entering directory `/home/raj/ecos-2.0/temp/packages/devs/watchdog/synth/v2_0/host'
make[1]: Nothing to be done for `all'.
make[1]: Leaving directory `/home/raj/ecos-2.0/temp/packages/devs/watchdog/synth/v2_0/host'
Making all in packages/hal/synth/arch/v2_0/host
make[1]: Entering directory `/home/raj/ecos-2.0/temp/packages/hal/synth/arch/v2_0/host'
gcc -I. -I../../../../../../../packages/hal/synth/arch/v2_0/host  -I/usr/X11R6/include   -pipe -Wall -Wpointer-arith -Wbad-function-cast -Wcast-qual -Wstrict-prototypes -Wmissing-prototypes -Wnested-externs -O0 -DECOSYNTH_VERSION=\"0.1\" -DECOS_REPOSITORY=\"/home/raj/ecos-2.0/packages\" -DLIBEXECDIR=\"/usr/local/ecos/libexec\" -DPACKAGE_DIR=\"hal/synth/arch\" -DPACKAGE_VERSION=\"v2_0\" -DPACKAGE_INSTALL=\"hal/synth/arch/v2_0\"  -c ../../../../../../../packages/hal/synth/arch/v2_0/host/ecosynth.cgcc -pipe -Wall -Wpointer-arith -Wbad-function-cast -Wcast-qual -Wstrict-prototypes -Wmissing-prototypes -Wnested-externs -O0 -DECOSYNTH_VERSION=\"0.1\" -DECOS_REPOSITORY=\"/home/raj/ecos-2.0/packages\" -DLIBEXECDIR=\"/usr/local/ecos/libexec\" -DPACKAGE_DIR=\"hal/synth/arch\" -DPACKAGE_VERSION=\"v2_0\" -DPACKAGE_INSTALL=\"hal/synth/arch/v2_0\"   -o ecosynth  ecosynth.o -L/usr/lib -ltk8.3 -L/usr/X11R6/lib -lX11 -ldl  -lieee -lm -L/usr/lib -ltcl8.3
make[1]: Leaving directory `/home/raj/ecos-2.0/temp/packages/hal/synth/arch/v2_0/host'
Making all in packages/io/usb/slave/v2_0/host
make[1]: Entering directory `/home/raj/ecos-2.0/temp/packages/io/usb/slave/v2_0/host'
gcc -DHAVE_LINUX_USB_H=1 -DHAVE_LINUX_USBDEVICE_FS_H=1  -I. -I../../../../../../../packages/io/usb/slave/v2_0/host     -pipe
-Wall -Wpointer-arith -Wbad-function-cast -Wcast-qual -Wstrict-prototypes -Wmissing-prototypes -Wnested-externs -O0 -DUSBHOST_VERSION=\"0.1\" -DPKGVERSION=\"v2_0\" -DUSBAUXDIR=\"/usr/local/ecos/libexec/ecos/io/usb/slave/v2_0\"  -c ../../../../../../../packages/io/usb/slave/v2_0/host/usbhost.c
gcc -pipe -Wall -Wpointer-arith -Wbad-function-cast -Wcast-qual -Wstrict-prototypes -Wmissing-prototypes -Wnested-externs -O0 -DUSBHOST_VERSION=\"0.1\" -DPKGVERSION=\"v2_0\" -DUSBAUXDIR=\"/usr/local/ecos/libexec/ecos/io/usb/slave/v2_0\"   -o usbhost
 usbhost.o -lpthread -L/usr/lib -ltcl8.3
gcc -DHAVE_LINUX_USB_H=1 -DHAVE_LINUX_USBDEVICE_FS_H=1  -I. -I../../../../../../../packages/io/usb/slave/v2_0/host     -pipe
-Wall -Wpointer-arith -Wbad-function-cast -Wcast-qual -Wstrict-prototypes -Wmissing-prototypes -Wnested-externs -O0 -DUSBHOST_VERSION=\"0.1\" -DPKGVERSION=\"v2_0\" -DUSBAUXDIR=\"/usr/local/ecos/libexec/ecos/io/usb/slave/v2_0\"  -c ../../../../../../../packages/io/usb/slave/v2_0/host/usbchmod.c
gcc -pipe -Wall -Wpointer-arith -Wbad-function-cast -Wcast-qual -Wstrict-prototypes -Wmissing-prototypes -Wnested-externs -O0 -DUSBHOST_VERSION=\"0.1\" -DPKGVERSION=\"v2_0\" -DUSBAUXDIR=\"/usr/local/ecos/libexec/ecos/io/usb/slave/v2_0\"   -o usbchmod  usbchmod.o  -L/usr/lib -ltcl8.3
usbchmod.o(.text+0x3e6): In function `main':
: `sys_errlist' is deprecated; use `strerror' or `strerror_r' instead
usbchmod.o(.text+0x3d4): In function `main':
: `sys_nerr' is deprecated; use `strerror' or `strerror_r' instead
make[1]: Leaving directory `/home/raj/ecos-2.0/temp/packages/io/usb/slave/v2_0/host'
Making all in packages/devs/eth/synth/ecosynth/v2_0/host
make[1]: Entering directory `/home/raj/ecos-2.0/temp/packages/devs/eth/synth/ecosynth/v2_0/host'
gcc -DHAVE_LINUX_IF_TUN_H=1  -I. -I../../../../../../../../packages/devs/eth/synth/ecosynth/v2_0/host     -pipe -Wall -Wpointer-arith -Wbad-function-cast -Wcast-qual -Wstrict-prototypes -Wmissing-prototypes -Wnested-externs -O0 -DECOSYNTH_VERSION=\"0.1\" -DECOS_REPOSITORY=\"/home/raj/ecos-2.0/packages\" -DLIBEXECDIR=\"/usr/local/ecos/libexec\" -DPACKAGE_DIR=\"devs/eth/synth/ecosynth\" -DPACKAGE_VERSION=\"v2_0\" -DPACKAGE_INSTALL=\"devs/eth/synth/ecosynth/v2_0\"  -c ../../../../../../../../packages/devs/eth/synth/ecosynth/v2_0/host/rawether.c
gcc -pipe -Wall -Wpointer-arith -Wbad-function-cast -Wcast-qual -Wstrict-prototypes -Wmissing-prototypes -Wnested-externs -O0 -DECOSYNTH_VERSION=\"0.1\" -DECOS_REPOSITORY=\"/home/raj/ecos-2.0/packages\" -DLIBEXECDIR=\"/usr/local/ecos/libexec\" -DPACKAGE_DIR=\"devs/eth/synth/ecosynth\" -DPACKAGE_VERSION=\"v2_0\" -DPACKAGE_INSTALL=\"devs/eth/synth/ecosynth/v2_0\"   -o rawether  rawether.o
rawether.o(.text+0x480): In function `real_init':
: `sys_errlist' is deprecated; use `strerror' or `strerror_r' instead
rawether.o(.text+0x470): In function `real_init':
: `sys_nerr' is deprecated; use `strerror' or `strerror_r' instead
make[1]: Leaving directory `/home/raj/ecos-2.0/temp/packages/devs/eth/synth/ecosynth/v2_0/host'
make[1]: Entering directory `/home/raj/ecos-2.0/temp'
make[1]: Nothing to be done for `all-am'.
make[1]: Leaving directory `/home/raj/ecos-2.0/temp'
[root@rajshekar temp]# make install
Making install in tools/src
make[1]: Entering directory `/home/raj/ecos-2.0/temp/tools/src'
Making install in infra
make[2]: Entering directory `/home/raj/ecos-2.0/temp/tools/src/infra'
Making install in testsuite
make[3]: Entering directory `/home/raj/ecos-2.0/temp/tools/src/infra/testsuite'
make[4]: Entering directory `/home/raj/ecos-2.0/temp/tools/src/infra/testsuite'
make[4]: Nothing to be done for `install-exec-am'.
make[4]: Nothing to be done for `install-data-am'.
make[4]: Leaving directory `/home/raj/ecos-2.0/temp/tools/src/infra/testsuite'
make[3]: Leaving directory `/home/raj/ecos-2.0/temp/tools/src/infra/testsuite'
make[3]: Entering directory `/home/raj/ecos-2.0/temp/tools/src/infra'
make[4]: Entering directory `/home/raj/ecos-2.0/temp/tools/src/infra'
/bin/sh ../../../../tools/src/infra/../../acsupport/mkinstalldirs /usr/local/ecos/lib
/usr/bin/install -c libcyginfra.a /usr/local/ecos/lib/libcyginfra.a
/bin/sh ../../../../tools/src/infra/../../acsupport/mkinstalldirs  /usr/local/ecos/include \
                /usr/local/ecos/include/cyg       \
                /usr/local/ecos/include/cyg/infra \
                /usr/local/ecos/include/cyg/hal   \
                /usr/local/ecos/include/pkgconf
/usr/bin/install -c -m 644 cyg/infra/cyg_type.h    /usr/local/ecos/include/cyg/infra
/usr/bin/install -c -m 644 cyg/infra/cyg_ass.h     /usr/local/ecos/include/cyg/infra
/usr/bin/install -c -m 644 cyg/infra/cyg_trac.h    /usr/local/ecos/include/cyg/infra
/usr/bin/install -c -m 644 cyg/infra/testcase.h    /usr/local/ecos/include/cyg/infra
/usr/bin/install -c -m 644 cyg/hal/basetype.h      /usr/local/ecos/include/cyg/hal
/usr/bin/install -c -m 644 pkgconf/infra.h         /usr/local/ecos/include/pkgconf
/usr/bin/install -c -m 644 pkgconf/hostinfra.h     /usr/local/ecos/include/pkgconf
make[4]: Leaving directory `/home/raj/ecos-2.0/temp/tools/src/infra'
make[3]: Leaving directory `/home/raj/ecos-2.0/temp/tools/src/infra'
make[2]: Leaving directory `/home/raj/ecos-2.0/temp/tools/src/infra'
Making install in libcdl
make[2]: Entering directory `/home/raj/ecos-2.0/temp/tools/src/libcdl'
Making install in testsuite
make[3]: Entering directory `/home/raj/ecos-2.0/temp/tools/src/libcdl/testsuite'
make[4]: Entering directory `/home/raj/ecos-2.0/temp/tools/src/libcdl/testsuite'
make[4]: Nothing to be done for `install-exec-am'.
make[4]: Nothing to be done for `install-data-am'.
make[4]: Leaving directory `/home/raj/ecos-2.0/temp/tools/src/libcdl/testsuite'
make[3]: Leaving directory `/home/raj/ecos-2.0/temp/tools/src/libcdl/testsuite'
make[3]: Entering directory `/home/raj/ecos-2.0/temp/tools/src/libcdl'
make[4]: Entering directory `/home/raj/ecos-2.0/temp/tools/src/libcdl'
/bin/sh ../../../../tools/src/libcdl/../../acsupport/mkinstalldirs /usr/local/ecos/lib
/usr/bin/install -c libcdl.a /usr/local/ecos/lib/libcdl.a
/bin/sh ../../../../tools/src/libcdl/../../acsupport/mkinstalldirs /usr/local/ecos/include
 /usr/bin/install -c -m 644 ../../../../tools/src/libcdl/cdlcore.hxx /usr/local/ecos/include/cdlcore.hxx
 /usr/bin/install -c -m 644 ../../../../tools/src/libcdl/cdl.hxx /usr/local/ecos/include/cdl.hxx
make[4]: Leaving directory `/home/raj/ecos-2.0/temp/tools/src/libcdl'
make[3]: Leaving directory `/home/raj/ecos-2.0/temp/tools/src/libcdl'
make[2]: Leaving directory `/home/raj/ecos-2.0/temp/tools/src/libcdl'
Making install in tools/configtool/standalone/common
make[2]: Entering directory `/home/raj/ecos-2.0/temp/tools/src/tools/configtool/standalone/common'
make[3]: Entering directory `/home/raj/ecos-2.0/temp/tools/src/tools/configtool/standalone/common'
make[4]: Entering directory `/home/raj/ecos-2.0/temp/tools/src/tools/configtool/standalone/common'
/bin/sh ../../../../../../../tools/src/tools/configtool/standalone/common/../../../../../acsupport/mkinstalldirs /usr/local/ecos/bin
  /usr/bin/install -c  ecosconfig /usr/local/ecos/bin/ecosconfig
make[4]: Nothing to be done for `install-data-am'.
make[4]: Leaving directory `/home/raj/ecos-2.0/temp/tools/src/tools/configtool/standalone/common'
make[3]: Leaving directory `/home/raj/ecos-2.0/temp/tools/src/tools/configtool/standalone/common'
make[2]: Leaving directory `/home/raj/ecos-2.0/temp/tools/src/tools/configtool/standalone/common'
make[2]: Entering directory `/home/raj/ecos-2.0/temp/tools/src'
make[3]: Entering directory `/home/raj/ecos-2.0/temp/tools/src'
make[3]: Nothing to be done for `install-exec-am'.
make[3]: Nothing to be done for `install-data-am'.
make[3]: Leaving directory `/home/raj/ecos-2.0/temp/tools/src'
make[2]: Leaving directory `/home/raj/ecos-2.0/temp/tools/src'
make[1]: Leaving directory `/home/raj/ecos-2.0/temp/tools/src'
Making install in packages/devs/watchdog/synth/v2_0/host
make[1]: Entering directory `/home/raj/ecos-2.0/temp/packages/devs/watchdog/synth/v2_0/host'
make[2]: Entering directory `/home/raj/ecos-2.0/temp/packages/devs/watchdog/synth/v2_0/host'
make[2]: Nothing to be done for `install-exec-am'.
/bin/sh ../../../../../../../packages/devs/watchdog/synth/v2_0/host/../../../../../../acsupport/mkinstalldirs /usr/local/ecos/libexec/ecos/devs/watchdog/synth/v2_0
 /usr/bin/install -c -m 644 ../../../../../../../packages/devs/watchdog/synth/v2_0/host/watchdog.tcl /usr/local/ecos/libexec/ecos/devs/watchdog/synth/v2_0/watchdog.tcl
 /usr/bin/install -c -m 644 ../../../../../../../packages/devs/watchdog/synth/v2_0/host/watchdog.tdf /usr/local/ecos/libexec/ecos/devs/watchdog/synth/v2_0/watchdog.tdf
 /usr/bin/install -c -m 644 ../../../../../../../packages/devs/watchdog/synth/v2_0/host/alarm.gif /usr/local/ecos/libexec/ecos/devs/watchdog/synth/v2_0/alarm.gif
 /usr/bin/install -c -m 644 ../../../../../../../packages/devs/watchdog/synth/v2_0/host/doghouse.gif /usr/local/ecos/libexec/ecos/devs/watchdog/synth/v2_0/doghouse.gif
 /usr/bin/install -c -m 644 ../../../../../../../packages/devs/watchdog/synth/v2_0/host/eye.gif /usr/local/ecos/libexec/ecos/devs/watchdog/synth/v2_0/eye.gif
 /usr/bin/install -c -m 644 ../../../../../../../packages/devs/watchdog/synth/v2_0/host/asleep.gif /usr/local/ecos/libexec/ecos/devs/watchdog/synth/v2_0/asleep.gif
 /usr/bin/install -c -m 644 ../../../../../../../packages/devs/watchdog/synth/v2_0/host/sound1.au /usr/local/ecos/libexec/ecos/devs/watchdog/synth/v2_0/sound1.au
 /usr/bin/install -c -m 644 ../../../../../../../packages/devs/watchdog/synth/v2_0/host/sound2.au /usr/local/ecos/libexec/ecos/devs/watchdog/synth/v2_0/sound2.au
make[2]: Leaving directory `/home/raj/ecos-2.0/temp/packages/devs/watchdog/synth/v2_0/host'
make[1]: Leaving directory `/home/raj/ecos-2.0/temp/packages/devs/watchdog/synth/v2_0/host'
Making install in packages/hal/synth/arch/v2_0/host
make[1]: Entering directory `/home/raj/ecos-2.0/temp/packages/hal/synth/arch/v2_0/host'
make[2]: Entering directory `/home/raj/ecos-2.0/temp/packages/hal/synth/arch/v2_0/host'
make[2]: Nothing to be done for `install-exec-am'.
/bin/sh ../../../../../../../packages/hal/synth/arch/v2_0/host/../../../../../../acsupport/mkinstalldirs /usr/local/ecos/libexec/ecos/hal/synth/arch/v2_0
  /usr/bin/install -c  ecosynth /usr/local/ecos/libexec/ecos/hal/synth/arch/v2_0/ecosynth
/bin/sh ../../../../../../../packages/hal/synth/arch/v2_0/host/../../../../../../acsupport/mkinstalldirs /usr/local/ecos/libexec/ecos/hal/synth/arch/v2_0
 /usr/bin/install -c -m 644 ../../../../../../../packages/hal/synth/arch/v2_0/host/ecosynth.tcl /usr/local/ecos/libexec/ecos/hal/synth/arch/v2_0/ecosynth.tcl
 /usr/bin/install -c -m 644 ../../../../../../../packages/hal/synth/arch/v2_0/host/default.tdf /usr/local/ecos/libexec/ecos/hal/synth/arch/v2_0/default.tdf
 /usr/bin/install -c -m 644 ../../../../../../../packages/hal/synth/arch/v2_0/host/user_initrc.tcl /usr/local/ecos/libexec/ecos/hal/synth/arch/v2_0/user_initrc.tcl
 /usr/bin/install -c -m 644 ../../../../../../../packages/hal/synth/arch/v2_0/host/user_mainrc.tcl /usr/local/ecos/libexec/ecos/hal/synth/arch/v2_0/user_mainrc.tcl
 /usr/bin/install -c -m 644 ../../../../../../../packages/hal/synth/arch/v2_0/host/console.tcl /usr/local/ecos/libexec/ecos/hal/synth/arch/v2_0/console.tcl
 /usr/bin/install -c -m 644 ../../../../../../../packages/hal/synth/arch/v2_0/host/ecosicon.xbm /usr/local/ecos/libexec/ecos/hal/synth/arch/v2_0/ecosicon.xbm
 /usr/bin/install -c -m 644 ../../../../../../../packages/hal/synth/arch/v2_0/host/ecosiconmask.xbm /usr/local/ecos/libexec/ecos/hal/synth/arch/v2_0/ecosiconmask.xbm
 /usr/bin/install -c -m 644 ../../../../../../../packages/hal/synth/arch/v2_0/host/tick_yes.xbm /usr/local/ecos/libexec/ecos/hal/synth/arch/v2_0/tick_yes.xbm
 /usr/bin/install -c -m 644 ../../../../../../../packages/hal/synth/arch/v2_0/host/tick_no.xbm /usr/local/ecos/libexec/ecos/hal/synth/arch/v2_0/tick_no.xbm
 /usr/bin/install -c -m 644 ../../../../../../../packages/hal/synth/arch/v2_0/host/save.xbm /usr/local/ecos/libexec/ecos/hal/synth/arch/v2_0/save.xbm
 /usr/bin/install -c -m 644 ../../../../../../../packages/hal/synth/arch/v2_0/host/cut.xbm /usr/local/ecos/libexec/ecos/hal/synth/arch/v2_0/cut.xbm
 /usr/bin/install -c -m 644 ../../../../../../../packages/hal/synth/arch/v2_0/host/copy.xbm /usr/local/ecos/libexec/ecos/hal/synth/arch/v2_0/copy.xbm
 /usr/bin/install -c -m 644 ../../../../../../../packages/hal/synth/arch/v2_0/host/paste.xbm /usr/local/ecos/libexec/ecos/hal/synth/arch/v2_0/paste.xbm
 /usr/bin/install -c -m 644 ../../../../../../../packages/hal/synth/arch/v2_0/host/help.xbm /usr/local/ecos/libexec/ecos/hal/synth/arch/v2_0/help.xbm
 /usr/bin/install -c -m 644 ../../../../../../../packages/hal/synth/arch/v2_0/host/running1.ppm /usr/local/ecos/libexec/ecos/hal/synth/arch/v2_0/running1.ppm
 /usr/bin/install -c -m 644 ../../../../../../../packages/hal/synth/arch/v2_0/host/saveall.xbm /usr/local/ecos/libexec/ecos/hal/synth/arch/v2_0/saveall.xbm
make[2]: Leaving directory `/home/raj/ecos-2.0/temp/packages/hal/synth/arch/v2_0/host'
make[1]: Leaving directory `/home/raj/ecos-2.0/temp/packages/hal/synth/arch/v2_0/host'
Making install in packages/io/usb/slave/v2_0/host
make[1]: Entering directory `/home/raj/ecos-2.0/temp/packages/io/usb/slave/v2_0/host'
make[2]: Entering directory `/home/raj/ecos-2.0/temp/packages/io/usb/slave/v2_0/host'
make  install-exec-hook
make[3]: Entering directory `/home/raj/ecos-2.0/temp/packages/io/usb/slave/v2_0/host'
/usr/bin/install -c  usbhost /usr/local/ecos/bin/usbhost_v2_0
rm -f /usr/local/ecos/bin/usbhost
ln -s /usr/local/ecos/bin/usbhost_v2_0 /usr/local/ecos/bin/usbhost
make[3]: Leaving directory `/home/raj/ecos-2.0/temp/packages/io/usb/slave/v2_0/host'
/bin/sh ../../../../../../../packages/io/usb/slave/v2_0/host/../../../../../../acsupport/mkinstalldirs /usr/local/ecos/libexec/ecos/io/usb/slave/v2_0
  /usr/bin/install -c  usbchmod /usr/local/ecos/libexec/ecos/io/usb/slave/v2_0/usbchmod
/bin/sh ../../../../../../../packages/io/usb/slave/v2_0/host/../../../../../../acsupport/mkinstalldirs /usr/local/ecos/libexec/ecos/io/usb/slave/v2_0
 /usr/bin/install -c -m 644 ../../../../../../../packages/io/usb/slave/v2_0/host/usbhost.tcl /usr/local/ecos/libexec/ecos/io/usb/slave/v2_0/usbhost.tcl
 /usr/bin/install -c -m 644 ../../../../../../../packages/io/usb/slave/v2_0/host/list.tcl /usr/local/ecos/libexec/ecos/io/usb/slave/v2_0/list.tcl
 /usr/bin/install -c -m 644 ../../../../../../../packages/io/usb/slave/v2_0/host/verbose.tcl /usr/local/ecos/libexec/ecos/io/usb/slave/v2_0/verbose.tcl
make  install-data-hook
make[3]: Entering directory `/home/raj/ecos-2.0/temp/packages/io/usb/slave/v2_0/host'
chown root /usr/local/ecos/libexec/ecos/io/usb/slave/v2_0/usbchmod
chmod u+s /usr/local/ecos/libexec/ecos/io/usb/slave/v2_0/usbchmod
make[3]: Leaving directory `/home/raj/ecos-2.0/temp/packages/io/usb/slave/v2_0/host'
make[2]: Leaving directory `/home/raj/ecos-2.0/temp/packages/io/usb/slave/v2_0/host'
make[1]: Leaving directory `/home/raj/ecos-2.0/temp/packages/io/usb/slave/v2_0/host'
Making install in packages/devs/eth/synth/ecosynth/v2_0/host
make[1]: Entering directory `/home/raj/ecos-2.0/temp/packages/devs/eth/synth/ecosynth/v2_0/host'
make[2]: Entering directory `/home/raj/ecos-2.0/temp/packages/devs/eth/synth/ecosynth/v2_0/host'
make[2]: Nothing to be done for `install-exec-am'.
/bin/sh ../../../../../../../../packages/devs/eth/synth/ecosynth/v2_0/host/../../../../../../../acsupport/mkinstalldirs /usr/local/ecos/libexec/ecos/devs/eth/synth/ecosynth/v2_0
  /usr/bin/install -c  rawether /usr/local/ecos/libexec/ecos/devs/eth/synth/ecosynth/v2_0/rawether
/bin/sh ../../../../../../../../packages/devs/eth/synth/ecosynth/v2_0/host/../../../../../../../acsupport/mkinstalldirs /usr/local/ecos/libexec/ecos/devs/eth/synth/ecosynth/v2_0
 /usr/bin/install -c -m 644 ../../../../../../../../packages/devs/eth/synth/ecosynth/v2_0/host/ethernet.tcl /usr/local/ecos/libexec/ecos/devs/eth/synth/ecosynth/v2_0/ethernet.tcl
 /usr/bin/install -c -m 644 ../../../../../../../../packages/devs/eth/synth/ecosynth/v2_0/host/ethernet.tdf /usr/local/ecos/libexec/ecos/devs/eth/synth/ecosynth/v2_0/ethernet.tdf
 /usr/bin/install -c -m 644 ../../../../../../../../packages/devs/eth/synth/ecosynth/v2_0/host/netrecord.xbm /usr/local/ecos/libexec/ecos/devs/eth/synth/ecosynth/v2_0/netrecord.xbm
make  install-data-hook
make[3]: Entering directory `/home/raj/ecos-2.0/temp/packages/devs/eth/synth/ecosynth/v2_0/host'
chown root /usr/local/ecos/libexec/ecos/devs/eth/synth/ecosynth/v2_0/rawether
chmod u+s /usr/local/ecos/libexec/ecos/devs/eth/synth/ecosynth/v2_0/rawether
make[3]: Leaving directory `/home/raj/ecos-2.0/temp/packages/devs/eth/synth/ecosynth/v2_0/host'
make[2]: Leaving directory `/home/raj/ecos-2.0/temp/packages/devs/eth/synth/ecosynth/v2_0/host'
make[1]: Leaving directory `/home/raj/ecos-2.0/temp/packages/devs/eth/synth/ecosynth/v2_0/host'
make[1]: Entering directory `/home/raj/ecos-2.0/temp'
make[2]: Entering directory `/home/raj/ecos-2.0/temp'
make[2]: Nothing to be done for `install-exec-am'.
make[2]: Nothing to be done for `install-data-am'.
make[2]: Leaving directory `/home/raj/ecos-2.0/temp'
make[1]: Leaving directory `/home/raj/ecos-2.0/temp'
[root@rajshekar temp]# make check
Making check in tools/src
make[1]: Entering directory `/home/raj/ecos-2.0/temp/tools/src'
Making check in infra
make[2]: Entering directory `/home/raj/ecos-2.0/temp/tools/src/infra'
Making check in testsuite
make[3]: Entering directory `/home/raj/ecos-2.0/temp/tools/src/infra/testsuite'
make  check-DEJAGNU
make[4]: Entering directory `/home/raj/ecos-2.0/temp/tools/src/infra/testsuite'
Making a new site.exp file...
srcdir=`cd ../../../../../tools/src/infra/testsuite && pwd`; export srcdir; \
EXPECT=expect; export EXPECT; \
runtest=runtest; \
if /bin/sh -c "$runtest --version" > /dev/null 2>&1; then \
  $runtest --tool cyginfra --srcdir $srcdir ; \
else echo "WARNING: could not find \`runtest'" 1>&2; :;\
fi
WARNING: Couldn't find the global config file.
Test Run By raj on Wed Jun 23 18:29:02 2004
Native configuration is i686-pc-linux-gnu
 
                === cyginfra tests ===
 
Schedule of variations:
    unix
 
Running target unix
Using /usr/share/dejagnu/baseboards/unix.exp as board description file for target.
Using /usr/share/dejagnu/config/unix.exp as generic interface file for target.
Using /home/raj/ecos-2.0/tools/src/infra/testsuite/config/default.exp as tool-and-target-specific interface file.
Running /home/raj/ecos-2.0/tools/src/infra/testsuite/cyginfra/assert.exp ...
Running /home/raj/ecos-2.0/tools/src/infra/testsuite/cyginfra/regress.exp ...
Running /home/raj/ecos-2.0/tools/src/infra/testsuite/cyginfra/trace.exp ...
 
                === cyginfra Summary ===
 
# of expected passes            14
# of unsupported tests          1
/home/raj/ecos-2.0/temp/tools/src/infra/testsuite/libcyginfra.a 0.1
make[4]: Leaving directory `/home/raj/ecos-2.0/temp/tools/src/infra/testsuite'
make[3]: Leaving directory `/home/raj/ecos-2.0/temp/tools/src/infra/testsuite'
make[3]: Entering directory `/home/raj/ecos-2.0/temp/tools/src/infra'
make[3]: Leaving directory `/home/raj/ecos-2.0/temp/tools/src/infra'
make[2]: Leaving directory `/home/raj/ecos-2.0/temp/tools/src/infra'
Making check in libcdl
make[2]: Entering directory `/home/raj/ecos-2.0/temp/tools/src/libcdl'
Making check in testsuite
make[3]: Entering directory `/home/raj/ecos-2.0/temp/tools/src/libcdl/testsuite'
make  check-DEJAGNU
make[4]: Entering directory `/home/raj/ecos-2.0/temp/tools/src/libcdl/testsuite'
Making a new site.exp file...
srcdir=`cd ../../../../../tools/src/libcdl/testsuite && pwd`; export srcdir; \
EXPECT=expect; export EXPECT; \
runtest=runtest; \
if /bin/sh -c "$runtest --version" > /dev/null 2>&1; then \
  $runtest --tool libcdl --srcdir $srcdir ; \
else echo "WARNING: could not find \`runtest'" 1>&2; :;\
fi
WARNING: Couldn't find the global config file.
Test Run By raj on Wed Jun 23 18:29:08 2004
Native configuration is i686-pc-linux-gnu
 
                === libcdl tests ===
 
Schedule of variations:
    unix
 
Running target unix
Using /usr/share/dejagnu/baseboards/unix.exp as board description file for target.
Using /usr/share/dejagnu/config/unix.exp as generic interface file for target.
Using /home/raj/ecos-2.0/tools/src/libcdl/testsuite/config/default.exp as tool-and-target-specific interface file.
Running /home/raj/ecos-2.0/tools/src/libcdl/testsuite/libcdl/cdl.exp ...
FAIL: unable to compile test case cdl4, hosttest_compile: failed to link /home/raj/ecos-2.0/temp/tools/src/libcdl/testsuite/testcase/cdl4
Running /home/raj/ecos-2.0/tools/src/libcdl/testsuite/libcdl/regress.exp ...
 
                === libcdl Summary ===
 
# of unexpected failures        1
/home/raj/ecos-2.0/temp/tools/src/libcdl/testsuite/libcdl.a 0.2
make[4]: *** [check-DEJAGNU] Error 1
make[4]: Leaving directory `/home/raj/ecos-2.0/temp/tools/src/libcdl/testsuite'
make[3]: *** [check-am] Error 2
make[3]: Leaving directory `/home/raj/ecos-2.0/temp/tools/src/libcdl/testsuite'
make[2]: *** [check-recursive] Error 1
make[2]: Leaving directory `/home/raj/ecos-2.0/temp/tools/src/libcdl'
make[1]: *** [check-recursive] Error 1
make[1]: Leaving directory `/home/raj/ecos-2.0/temp/tools/src'
make: *** [check-recursive] Error 1


[raj@rajshekar ecos2.0]$ uname -a
Linux rajshekar 2.4.20-8 #1 Thu Mar 13 17:54:28 EST 2003 i686 i686 i386 GNU/Linux

[raj@rajshekar ecos2.0]$ ls /usr/lib/tcl*
/usr/lib/tclConfig.sh  /usr/lib/tclxConfig.sh
 
/usr/lib/tclX8.3:
pkgIndex.tcl

[raj@rajshekar ecos2.0]$ gcc --version
gcc (GCC) 3.2.2 20030222 (Red Hat Linux 3.2.2-5)
Copyright (C) 2002 Free Software Foundation, Inc.
This is free software; see the source for copying conditions.  There is NO
warranty; not even for MERCHANTABILITY or FITNESS FOR A PARTICULAR PURPOSE.


             reply	other threads:[~2004-06-23 13:55 UTC|newest]

Thread overview: 2+ messages / expand[flat|nested]  mbox.gz  Atom feed  top
2004-06-23 13:55 raj [this message]
2004-06-23 14:29 ` Jonathan Larmour

Reply instructions:

You may reply publicly to this message via plain-text email
using any one of the following methods:

* Save the following mbox file, import it into your mail client,
  and reply-to-all from there: mbox

  Avoid top-posting and favor interleaved quoting:
  https://en.wikipedia.org/wiki/Posting_style#Interleaved_style

* Reply using the --to, --cc, and --in-reply-to
  switches of git-send-email(1):

  git send-email \
    --in-reply-to=1087999323.27995.1.camel@rajshekar.ges \
    --to=rajshekar@globaledgesoft.com \
    --cc=ecos-maintainers@sources.redhat.com \
    /path/to/YOUR_REPLY

  https://kernel.org/pub/software/scm/git/docs/git-send-email.html

* If your mail client supports setting the In-Reply-To header
  via mailto: links, try the mailto: link
Be sure your reply has a Subject: header at the top and a blank line before the message body.
This is a public inbox, see mirroring instructions
for how to clone and mirror all data and code used for this inbox;
as well as URLs for read-only IMAP folder(s) and NNTP newsgroup(s).