public inbox for frysk-bugzilla@sourceware.org
help / color / mirror / Atom feed
[Bug general/2235] [tracker] Build problems - in Makefile.am, configure.ac, 
 2007-06-20 13:26 UTC  (2+ messages)

[Bug general/2789] frysk fails make distcheck
 2007-06-20 13:26 UTC 

[Bug general/2654] [tracker] Fedora Core 6
 2007-06-20 13:26 UTC 

[Bug general/4663] New: TaskObserver.Instruction doesn't appear to unblock on new process' first instructions
 2007-06-20 12:23 UTC  (3+ messages)
` [Bug general/4663] "

[Bug general/4299] New: System.exit() usage
 2007-06-20  8:38 UTC  (2+ messages)
` [Bug general/4299] "

[Bug general/4665] New: fhpd Exception in thread "Thread-1" java.lang.ClassCastException: frysk.rt.TaskStepEngine cannot be cast to frysk.proc.Task
 2007-06-19 21:53 UTC  (2+ messages)
` [Bug general/4665] "

[Bug general/3346] [tracker] Stepping
 2007-06-19 21:06 UTC  (7+ messages)

[Bug general/3760] New: fstep should step all Tasks
 2007-06-19  8:58 UTC  (2+ messages)
` [Bug general/3760] "

[Bug general/4652] New: Step over is disabled
 2007-06-18 17:28 UTC  (5+ messages)
` [Bug general/4652] "

[Bug general/4653] New: Broken javah building on fedora 7
 2007-06-18 16:03 UTC  (3+ messages)
` [Bug general/4653] "

[Bug general/4658] New: New ppc syscalls on Fedora 7 kernel (according to audit-libs)
 2007-06-18 11:04 UTC 

[Bug general/3620] [tracker] Fedora Core 7
 2007-06-15 17:37 UTC 

[Bug general/4601] New: Fedora 7 stacktrace problem: lib.dw.DwarfException: No class SharedType
 2007-06-15 17:36 UTC  (4+ messages)
` [Bug general/4601] "

[Bug general/1633] [tracker] source view / debugger view
 2007-06-15 16:02 UTC  (17+ messages)

[Bug general/4648] New: Trying to read from start_thread () frame gives ptrace errors
 2007-06-15 13:47 UTC  (3+ messages)
` [Bug general/4648] "

[Bug general/4573] New: (fhpd) print 0x012dc8 & ~0x1000 -format x
 2007-06-14 15:19 UTC  (2+ messages)
` [Bug general/4573] "

[Bug general/4574] New: (fhpd) print 0x4dbd8000 + 0x4dbebdc8 -format x
 2007-06-14 15:19 UTC  (2+ messages)
` [Bug general/4574] "

[Bug general/4498] New: crash when debuging a simple test program
 2007-06-14 15:03 UTC  (2+ messages)
` [Bug general/4498] "

[Bug general/4215] New: fhpd does not do hex subtraction
 2007-06-14 14:49 UTC  (2+ messages)
` [Bug general/4215] print 0x1 - 0x2 ;; hpd "

[Bug general/4272] New: ArrayType iterator limited to Java's primitive types
 2007-06-14 14:48 UTC  (2+ messages)
` [Bug general/4272] "

[Bug general/4642] New: frysk-imports testsuite hangs on multi_child_exec (x86_64 Fedora 7)
 2007-06-14 14:47 UTC 

[Bug general/4641] New: frysk-imports testsuite leaves processes hanging (x86_64 Fedora 7)
 2007-06-14 14:45 UTC 

[Bug general/4427] New: Random DwException build failure
 2007-06-14 14:17 UTC  (3+ messages)
` [Bug general/4427] "

[Bug general/1595] [tracker] core file support
 2007-06-13 22:02 UTC  (2+ messages)

[Bug general/4640] New: Protected [vdso] segments on some x86_64 kernels cause Corefile getMaps() to mismatch
 2007-06-13 22:02 UTC 

[Bug general/4634] New: Failed test: testVarValueChanged
 2007-06-12 21:45 UTC 

[Bug general/4632] New: fhpd crashes when trying to run funit-stacks
 2007-06-12 15:23 UTC  (2+ messages)
` [Bug general/4632] "

[Bug general/2246] [tracker] fhd: Frysk High Performance Debugger Forum Command Line Interface
 2007-06-12 15:22 UTC  (6+ messages)

[Bug general/4631] New: SourceWindow crashes when exposed to bash source
 2007-06-12 14:36 UTC 

[Bug general/4629] New: SourceWindowFactory cannot create a source window without procs
 2007-06-12 14:25 UTC 

[Bug general/4603] New: monitor->session->edit has too many selected processes
 2007-06-11 13:12 UTC  (2+ messages)
` [Bug general/4603] "

[Bug general/4584] New: Memory window does not appear on x86_64
 2007-06-09 17:39 UTC  (9+ messages)
` [Bug general/4584] "

[Bug general/4568] New: testAttachToAttachedOtherTask(frysk.proc.TestTaskObserver)junit.framework.AssertionFailedError
 2007-06-08 14:09 UTC  (6+ messages)
` [Bug general/4568] testAttachToAttachedOtherTask(frysk.proc.TestTaskObserver)junit.framework.AssertionFailedError

[Bug general/4604] New: testHpdBreakpointInline(frysk.bindir.TestFhd) FAILS
 2007-06-08 14:04 UTC 

[Bug general/4598] New: Make stepping work with breakpoints
 2007-06-07 14:51 UTC 

[Bug general/4251] New: quit gives NPE
 2007-06-05 18:38 UTC  (2+ messages)
` [Bug general/4251] "

[Bug general/3986] New: frysk.cli.hpd using Hashtable
 2007-06-05 18:28 UTC  (2+ messages)
` [Bug general/3986] "

[Bug general/4595] New: 'where' in fhpd when proc is running blows up
 2007-06-05 18:26 UTC  (2+ messages)
` [Bug general/4595] "

[Bug general/4561] New: Frysk Debug Window - Closing the window leaves the FryskGui process hanging
 2007-06-05 16:03 UTC  (2+ messages)
` [Bug general/4561] "

[Bug general/4585] New: Trying to enable menory window on x86_64 causing frysk + app hang when stopping execution
 2007-06-02  3:50 UTC 

[Bug general/4583] New: Build failure (configure does not check for some requirements)
 2007-06-02  3:01 UTC 

[Bug general/4581] New: feature: fstack to debug core files
 2007-06-01 14:42 UTC 

[Bug general/2244] [tracker] fstack: standalone program for pulling a multi-threaded stack trace
 2007-06-01 14:42 UTC  (3+ messages)

[Bug general/4549] New: DisplayVariable should not change if the variable does not
 2007-05-31 17:35 UTC  (2+ messages)
` [Bug general/4549] "

[Bug general/1582] [tracker] Process Model - frysk.proc
 2007-05-30 13:03 UTC  (2+ messages)

[Bug general/4054] New: [tracker] jline
 2007-05-29 22:13 UTC  (2+ messages)
` [Bug general/4054] "

[Bug general/4565] New: getTermwidth does not honor Terminal
 2007-05-29 22:13 UTC 

[Bug general/4564] New: running UNSUPPORTED tests leads to an abort()
 2007-05-29 21:32 UTC 

[Bug general/4562] New: Editing a session name causes a new session to be created
 2007-05-29 19:22 UTC  (2+ messages)
` [Bug general/4562] "

[Bug general/4560] New: Frysk Session Manager - no indication on what type a session is
 2007-05-29 18:42 UTC 

[Bug general/4546] New: Frysk Source window appears to have a file descriptor leak
 2007-05-29 14:54 UTC  (2+ messages)
` [Bug general/4546] "

[Bug general/4535] New: org.jdom.IllegalDataException: The data "..." is not legal for a JDOM character content: 0xc is not a legal XML character
 2007-05-28 21:00 UTC  (6+ messages)
` [Bug general/4535] "

[Bug general/4547] DisplayVariable tracker
 2007-05-25 17:41 UTC 

[Bug general/4193] New: add new process menu, to create a new debug process
 2007-05-24 20:43 UTC  (2+ messages)
` [Bug general/4193] "

[Bug general/4545] New: File descriptors are being inherited when frysk activates a task
 2007-05-24 20:42 UTC 

[Bug general/4544] New: StatelessFile has 64-bit problems
 2007-05-24 16:05 UTC 

[Bug general/4543] New: StatelessFile.unixPath isn't null terminated
 2007-05-24 16:01 UTC  (2+ messages)
` [Bug general/4543] "

[Bug general/4537] New: ftrace should use Host.requestFindProc, not Host.requestRefreshXXX
 2007-05-22 17:13 UTC 

[Bug general/4536] New: race in FCatch's exec code
 2007-05-22 17:06 UTC 

[Bug general/4534] New: java.lang.IllegalArgumentException: The given item name[funit-child Debug Session] is already used
 2007-05-22 16:56 UTC 

[Bug general/4533] New: "Summay" in monitor window
 2007-05-22 16:53 UTC 

[Bug general/4532] New: The given file [/home/cagney/.frysk/Sessions] is not a directory
 2007-05-22 16:49 UTC 

[Bug general/4530] New: Automake 1.10 issues warnings in elfutils
 2007-05-21 17:01 UTC  (2+ messages)
` [Bug general/4530] "

[Bug general/2785] [tracker] elfutils
 2007-05-21 16:47 UTC 

[Bug general/4524] New: Libunwind support for PowerPC
 2007-05-18 20:05 UTC  (2+ messages)
` [Bug general/4524] "

[Bug general/4508] New: java.lang.NullPointerException at frysk.gui.monitor.ListView.remove(FryskGui)
 2007-05-15 13:24 UTC  (2+ messages)
` [Bug general/4508] "

[Bug general/3584] frysk frysk
 2007-05-14 19:42 UTC 

[Bug general/3076] [tracker] libunwind
 2007-05-11 17:44 UTC 

[Bug general/4474] New: java.lang.NoSuchMethodException: <init> at frysk.gui.monitor.ObjectFactory.getObject(FryskGui)
 2007-05-09 17:34 UTC  (3+ messages)
` [Bug general/4474] "

[Bug general/3401] [tracker] New Session Assistant
 2007-05-09 12:51 UTC 

[Bug general/4468] New: testBacktrace(frysk.rt.TestStackBacktrace)java.util.ConcurrentModificationException
 2007-05-07 14:10 UTC 

[Bug general/3357] /bin/sh: line 1: 9179 Aborted (core dumped) ${dir}$tst
 2007-05-06 16:38 UTC 

[Bug general/2356] During a bash fork() stress test, frysk throws: did not handle PerformRemoval exception
 2007-05-06 16:36 UTC 

[Bug general/2234] [tracker] Test Framework - funit, make check, 
 2007-05-06 16:27 UTC 

[Bug general/4250] New: ftrace does not follow threads
 2007-05-04 20:11 UTC  (2+ messages)
` [Bug general/4250] "

[Bug general/2245] [tracker] ftrace: standalone program for displaying a system call trace
 2007-05-04 20:11 UTC  (7+ messages)

[Bug general/4249] New: ftrace -c /bin/true -- Exception in thread "Thread-1" java.lang.NullPointerException
 2007-05-04 20:02 UTC  (2+ messages)
` [Bug general/4249] "

[Bug general/4142] New: ftrace TestRunner, or frysk, shows no ptrace calls
 2007-05-04 19:57 UTC  (2+ messages)
` [Bug general/4142] "

[Bug general/4347] New: LinuxPtraceTask aborts when trying to activate a new Proc from Source Window
 2007-05-04 19:20 UTC  (2+ messages)
` [Bug general/4347] "

[Bug general/4111] New: ftrace crash
 2007-05-04 19:16 UTC  (2+ messages)
` [Bug general/4111] "

[Bug general/3053] random failure with ftrace
 2007-05-04 18:38 UTC 

[Bug general/3392] [tracker] Source Code, or Static Language Model - frysk.dom (well sort of)
 2007-05-04 15:04 UTC 

[Bug general/4462] New: Opening sourcewindow on funit-child org.jdom.IllegalDataException: The data " "is not legal for a JDOM character content: 0xc is not a legal XML character
 2007-05-04 15:04 UTC 

[Bug general/4443] New: testExport(frysk.gui.monitor.observers.TestObserverSaveLoad)junit.framework.AssertionFailedError: Number of Observers expected:<7> but was:<6>
 2007-05-03 20:10 UTC  (2+ messages)
` [Bug general/4443] "

[Bug general/4442] New: testSaveLoad(frysk.gui.test.TestSessionSaveLoad)java.lang.IllegalArgumentException: The given item name[1] is already used
 2007-05-03 20:10 UTC  (2+ messages)
` [Bug general/4442] "

[Bug general/4440] New: testSaveLoad(frysk.gui.monitor.observers.TestObserverSaveLoad)java.lang.NullPointerException
 2007-05-03 20:09 UTC  (2+ messages)
` [Bug general/4440] testSaveLoad(frysk.gui.monitor.observers.TestObserverSaveLoad)java.lang.NullPointerException

[Bug general/4441] New: testAddingRemovingFilters(frysk.gui.test.TestFilterManager)java.lang.IllegalArgumentException: You are trying to remove an object which does not belong to this list.If this is intentional catch the exception
 2007-05-03 20:09 UTC  (2+ messages)
` [Bug general/4441] "

[Bug general/4434] New: fhpd attach via 'test.x & fhpd $!' fails
 2007-05-02 18:04 UTC  (2+ messages)
` [Bug general/4434] "

[Bug general/4452] New: SIGKILL'd multithreaded processes do not seem to receive TerminatingEvents
 2007-05-02 15:14 UTC 

[Bug general/4451] New: SIGKILL
 2007-05-02 15:13 UTC  (2+ messages)
` [Bug general/4451] SIGKILL

[Bug general/4450] New: SourceWindow segfaults
 2007-05-02 13:01 UTC 

[Bug general/2935] [tracker] Runtime Model - frysk.rt
 2007-04-30 22:25 UTC  (2+ messages)

[Bug general/4431] New: AckDaemonProcess doesn't appear to fully wait
 2007-04-30 22:25 UTC  (4+ messages)
` [Bug general/4431] "

[Bug general/3200] [tracker] Disassembler window + implementation
 2007-04-27 13:42 UTC 

[Bug general/2237] frysk startup senarios tracker
 2007-04-24 18:38 UTC 

[Bug general/1654] Build out Program event monitoring
 2007-04-24 18:30 UTC  (2+ messages)

[Bug general/1992] getTasks() returns 0 tasks at updateExec()
 2007-04-24 18:30 UTC 

[Bug general/1987] Cascading observers do not work
 2007-04-24 18:29 UTC 

[Bug general/1668] custom observer model
 2007-04-24 18:27 UTC 

[Bug general/4399] New: Continue/Stop in Source WIndow causes ptrace to backtrace
 2007-04-23 15:15 UTC  (2+ messages)
` [Bug general/4399] "

[Bug general/4234] New: print array[x][y]
 2007-04-20 15:37 UTC  (2+ messages)
` [Bug general/4234] "

page:  |  | latest

This is a public inbox, see mirroring instructions
for how to clone and mirror all data and code used for this inbox;
as well as URLs for read-only IMAP folder(s) and NNTP newsgroup(s).