public inbox for gcc-bugs@sourceware.org
help / color / mirror / Atom feed
* [Bug target/42827]  New: error in building libgcc; error: 'BITS_PEP_UNIT' undeclared
@ 2010-01-21 14:18 marekarturpenther at gmail dot com
  2010-01-21 14:43 ` [Bug target/42827] error in building libgcc; error: 'BITS_PER_UNIT' undeclared rguenth at gcc dot gnu dot org
                   ` (5 more replies)
  0 siblings, 6 replies; 8+ messages in thread
From: marekarturpenther at gmail dot com @ 2010-01-21 14:18 UTC (permalink / raw)
  To: gcc-bugs

make[4]: Opuszczenie katalogu
`/home/data/gcc/build/gcc-4.3.4/i686-linux-gnu/libgcc'
/home/data/gcc/build/gcc-4.3.4/./gcc/xgcc
-B/home/data/gcc/build/gcc-4.3.4/./gcc/ -B/usr/i686-linux-gnu/bin/
-B/usr/i686-linux-gnu/lib/ -isystem /usr/i686-linux-gnu/include -isystem
/usr/i686-linux-gnu/sys-include -mmmx -m3dnow -msse -march=athlon-xp
-mtune=athlon-xp -O2 -pipe -DUSE_X86_ASM -DUSE_MMX_ASM -DUSE_3DNOW_ASM
-DUSE_SSE_ASM -DUSE_3DNOW_PREFETCH -mmmx -m3dnow -msse -march=athlon-xp
-mtune=athlon-xp -O2 -pipe -DUSE_X86_ASM -DUSE_MMX_ASM -DUSE_3DNOW_ASM
-DUSE_SSE_ASM -DUSE_3DNOW_PREFETCH -mmmx -m3dnow -msse -march=athlon-xp
-mtune=athlon-xp -O2 -pipe -DUSE_X86_ASM -DUSE_MMX_ASM -DUSE_3DNOW_ASM
-DUSE_SSE_ASM -DUSE_3DNOW_PREFETCH -mmmx -m3dnow -msse -march=athlon-xp
-mtune=athlon-xp -O2 -pipe -DUSE_X86_ASM -DUSE_MMX_ASM -DUSE_3DNOW_ASM
-DUSE_SSE_ASM -DUSE_3DNOW_PREFETCH -mmmx -m3dnow -msse -march=athlon-xp
-mtune=athlon-xp -O2 -pipe -DUSE_X86_ASM -DUSE_MMX_ASM -DUSE_3DNOW_ASM
-DUSE_SSE_ASM -DUSE_3DNOW_PREFETCH -g -fkeep-inline-functions -mmmx -m3dnow
-msse -march=athlon-xp -mtune=athlon-xp -O2 -pipe -DUSE_X86_ASM -DUSE_MMX_ASM
-DUSE_3DNOW_ASM -DUSE_SSE_ASM -DUSE_3DNOW_PREFETCH -mmmx -m3dnow -msse
-march=athlon-xp -mtune=athlon-xp -O2 -pipe -DUSE_X86_ASM -DUSE_MMX_ASM
-DUSE_3DNOW_ASM -DUSE_SSE_ASM -DUSE_3DNOW_PREFETCH -mmmx -m3dnow -msse
-march=athlon-xp -mtune=athlon-xp -O2 -pipe -DUSE_X86_ASM -DUSE_MMX_ASM
-DUSE_3DNOW_ASM -DUSE_SSE_ASM -DUSE_3DNOW_PREFETCH -mmmx -m3dnow -msse
-march=athlon-xp -mtune=athlon-xp -O2 -pipe -DUSE_X86_ASM -DUSE_MMX_ASM
-DUSE_3DNOW_ASM -DUSE_SSE_ASM -DUSE_3DNOW_PREFETCH  -I. -I. -I../.././gcc
-I../../../../sources/gcc-4.3.4/libgcc -I../../../../sources/gcc-4.3.4/libgcc/.
-I../../../../sources/gcc-4.3.4/libgcc/../gcc
-I../../../../sources/gcc-4.3.4/libgcc/../include
-I../../../../sources/gcc-4.3.4/libgcc/config/libbid
-DENABLE_DECIMAL_BID_FORMAT -DHAVE_CC_TLS -DUSE_TLS -o _muldi3.o -MT _muldi3.o
-MD -MP -MF _muldi3.dep -DL_muldi3 -c
../../../../sources/gcc-4.3.4/libgcc/../gcc/libgcc2.c \
          -fvisibility=hidden -DHIDE_EXPORTS
../../../../sources/gcc-4.3.4/libgcc/../gcc/libgcc2.c: In function
‘__mulhi3’:
../../../../sources/gcc-4.3.4/libgcc/../gcc/libgcc2.c:560: error:
‘BITS_PER_UNIT’ undeclared (first use in this function)
../../../../sources/gcc-4.3.4/libgcc/../gcc/libgcc2.c:560: error: (Each
undeclared identifier is reported only once
../../../../sources/gcc-4.3.4/libgcc/../gcc/libgcc2.c:560: error: for each
function it appears in.)
make[3]: *** [_muldi3.o] Błąd 1
make[3]: Opuszczenie katalogu
`/home/data/gcc/build/gcc-4.3.4/i686-linux-gnu/libgcc'
make[2]: *** [all-stage1-target-libgcc] Błąd 2
make[2]: Opuszczenie katalogu `/home/data/gcc/build/gcc-4.3.4'
make[1]: *** [stage1-bubble] Błąd 2
make[1]: Opuszczenie katalogu `/home/data/gcc/build/gcc-4.3.4'
make: *** [all] Błąd 2
r


-- 
           Summary: error in building libgcc; error: 'BITS_PEP_UNIT'
                    undeclared
           Product: gcc
           Version: 4.3.4
            Status: UNCONFIRMED
          Severity: blocker
          Priority: P3
         Component: target
        AssignedTo: unassigned at gcc dot gnu dot org
        ReportedBy: marekarturpenther at gmail dot com
 GCC build triplet: i686-linux-gnu
  GCC host triplet: i686-linux-gnu
GCC target triplet: i686-linux-gnu


http://gcc.gnu.org/bugzilla/show_bug.cgi?id=42827


^ permalink raw reply	[flat|nested] 8+ messages in thread
[parent not found: <bug-42827-4@http.gcc.gnu.org/bugzilla/>]

end of thread, other threads:[~2012-01-16  9:30 UTC | newest]

Thread overview: 8+ messages (download: mbox.gz / follow: Atom feed)
-- links below jump to the message on this page --
2010-01-21 14:18 [Bug target/42827] New: error in building libgcc; error: 'BITS_PEP_UNIT' undeclared marekarturpenther at gmail dot com
2010-01-21 14:43 ` [Bug target/42827] error in building libgcc; error: 'BITS_PER_UNIT' undeclared rguenth at gcc dot gnu dot org
2010-01-21 15:57 ` marekarturpenther at gmail dot com
2010-02-07 20:18 ` [Bug bootstrap/42827] " pinskia at gcc dot gnu dot org
2010-02-07 22:07 ` marekarturpenther at gmail dot com
2010-02-07 22:10 ` pinskia at gcc dot gnu dot org
2010-02-08  5:55 ` marekarturpenther at gmail dot com
     [not found] <bug-42827-4@http.gcc.gnu.org/bugzilla/>
2012-01-16  9:38 ` pinskia at gcc dot gnu.org

This is a public inbox, see mirroring instructions
for how to clone and mirror all data and code used for this inbox;
as well as URLs for read-only IMAP folder(s) and NNTP newsgroup(s).