public inbox for gcc-help@gcc.gnu.org
 help / color / mirror / Atom feed
* make check fail on package-unused version-unused
@ 2021-01-06  1:33 pillule
  2021-01-20 19:06 ` Jonathan Wakely
  0 siblings, 1 reply; 2+ messages in thread
From: pillule @ 2021-01-06  1:33 UTC (permalink / raw)
  To: gcc-help


Hello,

I compiled gcc-10.2.0 with the libraries provided by the 
`contrib/download_prerequisites` script.
The compilation doesn't throw an error but `make check` does.

The host OS is a HVM virtualised antiX-19 (debian) with gcc 8.3.0

Can someone be kind enough to help me to figure out what means 
this last trace and package-unused ?

━━━━━━━━━━━━━━━━━━━━━━━━━━━━━━━━━━━━━━━━━━━━━━━━━━━━━━━━━━━━━━━━━━━━━━━━━━━━

make[3]: Leaving directory '/mnt/_/build_gcc-10.2.0/libbacktrace'
make  check-TESTS
make[3]: Entering directory '/mnt/_/build_gcc-10.2.0/libbacktrace'
make[4]: Entering directory '/mnt/_/build_gcc-10.2.0/libbacktrace'
PASS: allocfail.sh
./install-debuginfo-for-buildid.sh \
  "/mnt/_/build_gcc-10.2.0/libbacktrace/usr/lib/debug/.build-id/" 
  \
  b2test
objcopy --strip-debug b2test b2test_buildid
FAIL: b2test_buildid
objcopy --only-keep-debug btest btest_gnudebuglink.debug
objcopy --strip-debug --add-gnu-debuglink=btest_gnudebuglink.debug 
btest btest_gnudebuglink
FAIL: btest_gnudebuglink
PASS: test_elf_32
PASS: test_elf_64
PASS: test_xcoff_32
PASS: test_xcoff_64
PASS: test_pecoff
PASS: test_unknown
PASS: unittest
PASS: unittest_alloc
FAIL: btest
FAIL: btest_lto
FAIL: btest_alloc
PASS: stest
PASS: stest_alloc
PASS: ztest
PASS: ztest_alloc
PASS: edtest
PASS: edtest_alloc
PASS: ttest
PASS: ttest_alloc
FAIL: ctestg
FAIL: ctesta
FAIL: ctestg_alloc
FAIL: ctesta_alloc
FAIL: dwarf5
FAIL: dwarf5_alloc
============================================================================
Testsuite summary for package-unused version-unused
============================================================================
# TOTAL: 28
# PASS:  17
# SKIP:  0
# XFAIL: 0
# FAIL:  11
# XPASS: 0
# ERROR: 0
============================================================================
See ./test-suite.log
============================================================================
make[4]: *** [Makefile:1729: test-suite.log] Error 1
make[4]: Leaving directory '/mnt/_/build_gcc-10.2.0/libbacktrace'
make[3]: *** [Makefile:1837: check-TESTS] Error 2
make[3]: Leaving directory '/mnt/_/build_gcc-10.2.0/libbacktrace'
make[2]: *** [Makefile:2087: check-am] Error 2
make[2]: Leaving directory '/mnt/_/build_gcc-10.2.0/libbacktrace'
make[1]: *** [Makefile:11994: check-libbacktrace] Error 2
make[1]: Leaving directory '/mnt/_/build_gcc-10.2.0'
make: *** [Makefile:2396: do-check] Error 2





━━━━━━━━━━━━━━━━━━━━━━━━━━━━━━━━━━━━━━━━━━━━━━━━━━━━━━━━━━━━━━━━━━━━━━━━━━━━

Here follows the content of test-suite.log

━━━━━━━━━━━━━━━━━━━━━━━━━━━━━━━━━━━━━━━━━━━━━━━━━━━━━━━━━━━━━━━━━━━━━━━━━━━━

=====================================================
   package-unused version-unused: ./test-suite.log
=====================================================

# TOTAL: 28
# PASS:  17
# SKIP:  0
# XFAIL: 0
# FAIL:  11
# XPASS: 0
# ERROR: 0

.. contents:: :depth: 2

FAIL: b2test_buildid
====================

ERROR: descriptor 3 still open after tests complete
PASS: backtrace_full noinline
PASS: backtrace_full inline
PASS: backtrace_simple noinline
PASS: backtrace_simple inline
PASS: backtrace_syminfo variable
FAIL b2test_buildid (exit status: 1)

FAIL: btest_gnudebuglink
========================

ERROR: descriptor 3 still open after tests complete
PASS: backtrace_full noinline
PASS: backtrace_full inline
PASS: backtrace_simple noinline
PASS: backtrace_simple inline
PASS: backtrace_syminfo variable
FAIL btest_gnudebuglink (exit status: 1)

FAIL: btest
===========

ERROR: descriptor 3 still open after tests complete
PASS: backtrace_full noinline
PASS: backtrace_full inline
PASS: backtrace_simple noinline
PASS: backtrace_simple inline
PASS: backtrace_syminfo variable
FAIL btest (exit status: 1)

FAIL: btest_lto
===============

ERROR: descriptor 3 still open after tests complete
PASS: backtrace_full noinline
PASS: backtrace_full inline
PASS: backtrace_simple noinline
PASS: backtrace_simple inline
PASS: backtrace_syminfo variable
FAIL btest_lto (exit status: 1)

FAIL: btest_alloc
=================

ERROR: descriptor 3 still open after tests complete
PASS: backtrace_full noinline
PASS: backtrace_full inline
PASS: backtrace_simple noinline
PASS: backtrace_simple inline
PASS: backtrace_syminfo variable
FAIL btest_alloc (exit status: 1)

FAIL: ctestg
============

ERROR: descriptor 3 still open after tests complete
PASS: backtrace_full noinline
PASS: backtrace_full inline
PASS: backtrace_simple noinline
PASS: backtrace_simple inline
PASS: backtrace_syminfo variable
FAIL ctestg (exit status: 1)

FAIL: ctesta
============

ERROR: descriptor 3 still open after tests complete
PASS: backtrace_full noinline
PASS: backtrace_full inline
PASS: backtrace_simple noinline
PASS: backtrace_simple inline
PASS: backtrace_syminfo variable
FAIL ctesta (exit status: 1)

FAIL: ctestg_alloc
==================

ERROR: descriptor 3 still open after tests complete
PASS: backtrace_full noinline
PASS: backtrace_full inline
PASS: backtrace_simple noinline
PASS: backtrace_simple inline
PASS: backtrace_syminfo variable
FAIL ctestg_alloc (exit status: 1)

FAIL: ctesta_alloc
==================

ERROR: descriptor 3 still open after tests complete
PASS: backtrace_full noinline
PASS: backtrace_full inline
PASS: backtrace_simple noinline
PASS: backtrace_simple inline
PASS: backtrace_syminfo variable
FAIL ctesta_alloc (exit status: 1)

FAIL: dwarf5
============

ERROR: descriptor 3 still open after tests complete
PASS: backtrace_full noinline
PASS: backtrace_full inline
PASS: backtrace_simple noinline
PASS: backtrace_simple inline
PASS: backtrace_syminfo variable
FAIL dwarf5 (exit status: 1)

FAIL: dwarf5_alloc
==================

ERROR: descriptor 3 still open after tests complete
PASS: backtrace_full noinline
PASS: backtrace_full inline
PASS: backtrace_simple noinline
PASS: backtrace_simple inline
PASS: backtrace_syminfo variable
FAIL dwarf5_alloc (exit status: 1)

-- 

^ permalink raw reply	[flat|nested] 2+ messages in thread

* Re: make check fail on package-unused version-unused
  2021-01-06  1:33 make check fail on package-unused version-unused pillule
@ 2021-01-20 19:06 ` Jonathan Wakely
  0 siblings, 0 replies; 2+ messages in thread
From: Jonathan Wakely @ 2021-01-20 19:06 UTC (permalink / raw)
  To: pillule; +Cc: gcc-help, Ian Lance Taylor

On Wed, 6 Jan 2021 at 01:35, pillule via Gcc-help <gcc-help@gcc.gnu.org> wrote:
>
>
> Hello,
>
> I compiled gcc-10.2.0 with the libraries provided by the
> `contrib/download_prerequisites` script.
> The compilation doesn't throw an error but `make check` does.
>
> The host OS is a HVM virtualised antiX-19 (debian) with gcc 8.3.0
>
> Can someone be kind enough to help me to figure out what means
> this last trace and package-unused ?

"package-unused version-unused" just means somebody didn't set some
variables in a config file, that's not a problem.

What you should care about is why the tests fail, not the missing
config strings. I am not familiar with the libbacktrace tests and
don't know what they mean.

^ permalink raw reply	[flat|nested] 2+ messages in thread

end of thread, other threads:[~2021-01-20 19:06 UTC | newest]

Thread overview: 2+ messages (download: mbox.gz / follow: Atom feed)
-- links below jump to the message on this page --
2021-01-06  1:33 make check fail on package-unused version-unused pillule
2021-01-20 19:06 ` Jonathan Wakely

This is a public inbox, see mirroring instructions
for how to clone and mirror all data and code used for this inbox;
as well as URLs for read-only IMAP folder(s) and NNTP newsgroup(s).