public inbox for gcc-testresults@sourceware.org
help / color / mirror / Atom feed
From: "Bill Seurer (POWER8 BE)" <seurer@linux.ibm.com>
To: gcc-testresults@gcc.gnu.org
Subject: Results for 13.0.0 20221001 (experimental) [remotes/origin/HEAD r13-3010-g2555071] (GCC) testsuite on powerpc64-unknown-linux-gnu
Date: Sat, 1 Oct 2022 04:14:19 -0500	[thread overview]
Message-ID: <20221001091419.GA79205@makalu-lp1.aus.stglabs.ibm.com> (raw)


git commit g:2555071c954aa5796eb3432c15739dcaae457bc3
gcc-descr r13-3010-g2555071c954aa5

Linux 3.10.0-1160.76.1.el7.ppc64 ppc64
GNU C Library (GNU libc) stable release version 2.17
GNU ld (GNU Binutils) 2.36.1
GNU assembler (GNU Binutils) 2.36.1
GNU Make 3.82

DejaGnu:
	Expect version is	5.45
	Tcl version is		8.5
	Framework version is	1.5.1

64-bit

LAST_UPDATED: Sat Oct  1 04:50:44 UTC 2022 (revision r13-3010-g2555071)

Native configuration is powerpc64-unknown-linux-gnu

		=== gcc tests ===


Running target unix/-m32
FAIL: gcc.dg/pr25521.c scan-assembler \\\\.rodata
FAIL: gcc.dg/pr56837.c scan-tree-dump-times optimized "memset ..c, 68, 16384.;" 1
FAIL: c-c++-common/goacc/struct-component-kind-1.c  at line 68 (test for errors, line 67)
FAIL: gcc.dg/torture/pr52451.c   -O0  execution test
FAIL: gcc.dg/torture/pr52451.c   -O1  execution test
FAIL: gcc.dg/torture/pr52451.c   -O2  execution test
FAIL: gcc.dg/torture/pr52451.c   -O2 -flto -fno-use-linker-plugin -flto-partition=none  execution test
FAIL: gcc.dg/torture/pr52451.c   -O2 -flto -fuse-linker-plugin -fno-fat-lto-objects  execution test
FAIL: gcc.dg/torture/pr52451.c   -O3 -g  execution test
FAIL: gcc.dg/torture/pr52451.c   -Os  execution test
FAIL: gcc.dg/torture/pr91323.c   -O0  execution test
FAIL: gcc.dg/torture/pr91323.c   -O1  execution test
FAIL: gcc.dg/torture/pr91323.c   -O2  execution test
FAIL: gcc.dg/torture/pr91323.c   -O2 -flto -fno-use-linker-plugin -flto-partition=none  execution test
FAIL: gcc.dg/torture/pr91323.c   -O2 -flto -fuse-linker-plugin -fno-fat-lto-objects  execution test
FAIL: gcc.dg/torture/pr91323.c   -O3 -g  execution test
FAIL: gcc.dg/torture/pr91323.c   -Os  execution test
FAIL: gcc.dg/tree-prof/cmpsf-1.c scan-tree-dump-not dom2 "Invalid sum"
FAIL: gcc.dg/tree-ssa/gen-vect-34.c scan-tree-dump-times vect "vectorized 1 loops" 1
XPASS: gcc.dg/vect/slp-24-big-array.c -flto -ffat-lto-objects  scan-tree-dump-times vect "vectorized 1 loops" 1
XPASS: gcc.dg/vect/slp-24-big-array.c -flto -ffat-lto-objects  scan-tree-dump-times vect "vectorizing stmts using SLP" 2
XPASS: gcc.dg/vect/slp-24-big-array.c scan-tree-dump-times vect "vectorized 1 loops" 1
XPASS: gcc.dg/vect/slp-24-big-array.c scan-tree-dump-times vect "vectorizing stmts using SLP" 2
XPASS: gcc.dg/vect/slp-24.c -flto -ffat-lto-objects  scan-tree-dump-times vect "vectorized 1 loops" 1
XPASS: gcc.dg/vect/slp-24.c -flto -ffat-lto-objects  scan-tree-dump-times vect "vectorizing stmts using SLP" 2
XPASS: gcc.dg/vect/slp-24.c scan-tree-dump-times vect "vectorized 1 loops" 1
XPASS: gcc.dg/vect/slp-24.c scan-tree-dump-times vect "vectorizing stmts using SLP" 2
FAIL: gcc.target/powerpc/bswap64-4.c scan-assembler-times ldbrx 1
FAIL: gcc.target/powerpc/bswap64-4.c scan-assembler-times stdbrx 1
FAIL: gcc.target/powerpc/fold-vec-extract-char.p7.c scan-assembler-times \\\\maddi\\\\M 9
FAIL: gcc.target/powerpc/fold-vec-extract-double.p7.c scan-assembler-times \\\\maddi\\\\M|\\\\madd\\\\M 3
FAIL: gcc.target/powerpc/fold-vec-extract-float.p7.c scan-assembler-times \\\\maddi\\\\M|\\\\madd\\\\M 3
FAIL: gcc.target/powerpc/fold-vec-extract-float.p8.c scan-assembler-times \\\\maddi\\\\M 2
FAIL: gcc.target/powerpc/fold-vec-extract-int.p7.c scan-assembler-times \\\\maddi\\\\M|\\\\madd\\\\M 12
FAIL: gcc.target/powerpc/fold-vec-extract-int.p8.c scan-assembler-times \\\\maddi\\\\M 9
FAIL: gcc.target/powerpc/fold-vec-extract-short.p7.c scan-assembler-times \\\\maddi\\\\M|\\\\madd\\\\M 12
FAIL: gcc.target/powerpc/fold-vec-extract-short.p8.c scan-assembler-times \\\\maddi\\\\M 9
FAIL: gcc.target/powerpc/pr105586.c (test for excess errors)
FAIL: gcc.target/powerpc/pr106550.c scan-assembler-times \\\\mrldimi\\\\M 2
FAIL: gcc.target/powerpc/pr106550_1.c (internal compiler error: maximum number of generated reload insns per insn achieved (90))
FAIL: gcc.target/powerpc/pr106550_1.c (test for excess errors)
UNRESOLVED: gcc.target/powerpc/pr106550_1.c scan-assembler-times \\\\mori\\\\M 2
UNRESOLVED: gcc.target/powerpc/pr106550_1.c scan-assembler-times \\\\moris\\\\M 2
UNRESOLVED: gcc.target/powerpc/pr106550_1.c scan-assembler-times \\\\mpli\\\\M 3
UNRESOLVED: gcc.target/powerpc/pr106550_1.c scan-assembler-times \\\\msldi\\\\M 3
FAIL: gcc.target/powerpc/rs6000-fpint.c scan-assembler-not stfiwx
XPASS: gcc.target/powerpc/ppc-fortran/ieee128-math.f90   -O  (test for excess errors)

		=== gcc Summary for unix/-m32 ===


Running target unix/-m64
FAIL: c-c++-common/asan/swapcontext-test-1.c   -O0  execution test
FAIL: c-c++-common/asan/swapcontext-test-1.c   -O1  execution test
FAIL: c-c++-common/asan/swapcontext-test-1.c   -O2  execution test
FAIL: c-c++-common/asan/swapcontext-test-1.c   -O2 -flto -fno-use-linker-plugin -flto-partition=none  execution test
FAIL: c-c++-common/asan/swapcontext-test-1.c   -O2 -flto -fuse-linker-plugin -fno-fat-lto-objects  execution test
FAIL: c-c++-common/asan/swapcontext-test-1.c   -O3 -fomit-frame-pointer -funroll-loops -fpeel-loops -ftracer -finline-functions  execution test
FAIL: c-c++-common/asan/swapcontext-test-1.c   -O3 -g  execution test
FAIL: c-c++-common/asan/swapcontext-test-1.c   -Os  execution test
FAIL: gcc.dg/pr56837.c scan-tree-dump-times optimized "memset ..c, 68, 16384.;" 1
FAIL: c-c++-common/goacc/struct-component-kind-1.c  at line 68 (test for errors, line 67)
FAIL: gcc.dg/torture/pr52451.c   -O0  execution test
FAIL: gcc.dg/torture/pr52451.c   -O1  execution test
FAIL: gcc.dg/torture/pr52451.c   -O2  execution test
FAIL: gcc.dg/torture/pr52451.c   -O2 -flto -fno-use-linker-plugin -flto-partition=none  execution test
FAIL: gcc.dg/torture/pr52451.c   -O2 -flto -fuse-linker-plugin -fno-fat-lto-objects  execution test
FAIL: gcc.dg/torture/pr52451.c   -O3 -g  execution test
FAIL: gcc.dg/torture/pr52451.c   -Os  execution test
FAIL: gcc.dg/torture/pr91323.c   -O0  execution test
FAIL: gcc.dg/torture/pr91323.c   -O1  execution test
FAIL: gcc.dg/torture/pr91323.c   -O2  execution test
FAIL: gcc.dg/torture/pr91323.c   -O2 -flto -fno-use-linker-plugin -flto-partition=none  execution test
FAIL: gcc.dg/torture/pr91323.c   -O2 -flto -fuse-linker-plugin -fno-fat-lto-objects  execution test
FAIL: gcc.dg/torture/pr91323.c   -O3 -g  execution test
FAIL: gcc.dg/torture/pr91323.c   -Os  execution test
FAIL: gcc.dg/tree-prof/cmpsf-1.c scan-tree-dump-not dom2 "Invalid sum"
FAIL: gcc.dg/tree-ssa/gen-vect-34.c scan-tree-dump-times vect "vectorized 1 loops" 1
XPASS: gcc.dg/tree-ssa/ssa-dom-cse-2.c scan-tree-dump optimized "return 28;"
WARNING: ThreadSanitizer: data race (pid=84750)
WARNING: ThreadSanitizer: data race (pid=84846)
FAIL: c-c++-common/tsan/race_on_mutex.c   -O0  output pattern test, is ==================
FAIL: c-c++-common/tsan/race_on_mutex.c   -O2  output pattern test, is ==================
FAIL: gcc.target/powerpc/20050603-3.c scan-assembler-not \\\\mrldic
FAIL: gcc.target/powerpc/pr56605.c scan-rtl-dump-times combine "\\\\(compare:CC \\\\((?:and|zero_extend):(?:[SD]I) \\\\((?:sub)?reg:[SD]I" 1
FAIL: gcc.target/powerpc/rlwimi-2.c scan-assembler-times (?n)^\\\\s+[a-z] 20217
FAIL: gcc.target/powerpc/rs6000-fpint.c scan-assembler-not stfiwx
XPASS: gcc.target/powerpc/ppc-fortran/ieee128-math.f90   -O  (test for excess errors)

		=== gcc Summary for unix/-m64 ===


		=== gcc Summary ===

/home/gccbuild/build/nightly/build-gcc-trunk/gcc/xgcc  version 13.0.0 20221001 (experimental) [remotes/origin/HEAD r13-3010-g2555071] (GCC) 

		=== gfortran tests ===


Running target unix/-m32
FAIL: gfortran.dg/ieee/fma_1.f90   -O0  execution test
FAIL: gfortran.dg/ieee/fma_1.f90   -O1  execution test
FAIL: gfortran.dg/ieee/fma_1.f90   -O2  execution test
FAIL: gfortran.dg/ieee/fma_1.f90   -O3 -fomit-frame-pointer -funroll-loops -fpeel-loops -ftracer -finline-functions  execution test
FAIL: gfortran.dg/ieee/fma_1.f90   -O3 -g  execution test
FAIL: gfortran.dg/ieee/fma_1.f90   -Os  execution test
FAIL: gfortran.dg/ieee/large_2.f90   -O0  execution test
FAIL: gfortran.dg/ieee/large_2.f90   -O1  execution test
FAIL: gfortran.dg/ieee/large_2.f90   -O2  execution test
FAIL: gfortran.dg/ieee/large_2.f90   -O3 -fomit-frame-pointer -funroll-loops -fpeel-loops -ftracer -finline-functions  execution test
FAIL: gfortran.dg/ieee/large_2.f90   -O3 -g  execution test
FAIL: gfortran.dg/ieee/large_2.f90   -Os  execution test

		=== gfortran Summary for unix/-m32 ===

# of expected passes		4050

Running target unix/-m64
FAIL: gfortran.dg/ieee/fma_1.f90   -O0  execution test
FAIL: gfortran.dg/ieee/fma_1.f90   -O1  execution test
FAIL: gfortran.dg/ieee/fma_1.f90   -O2  execution test
FAIL: gfortran.dg/ieee/fma_1.f90   -O3 -fomit-frame-pointer -funroll-loops -fpeel-loops -ftracer -finline-functions  execution test
FAIL: gfortran.dg/ieee/fma_1.f90   -O3 -g  execution test
FAIL: gfortran.dg/ieee/fma_1.f90   -Os  execution test
FAIL: gfortran.dg/ieee/large_2.f90   -O0  execution test
FAIL: gfortran.dg/ieee/large_2.f90   -O1  execution test
FAIL: gfortran.dg/ieee/large_2.f90   -O2  execution test
FAIL: gfortran.dg/ieee/large_2.f90   -O3 -fomit-frame-pointer -funroll-loops -fpeel-loops -ftracer -finline-functions  execution test
FAIL: gfortran.dg/ieee/large_2.f90   -O3 -g  execution test
FAIL: gfortran.dg/ieee/large_2.f90   -Os  execution test

		=== gfortran Summary for unix/-m64 ===

# of expected passes		4050

		=== gfortran Summary ===

# of expected passes		8100
/home/gccbuild/build/nightly/build-gcc-trunk/gcc/testsuite/gfortran/../../gfortran  version 13.0.0 20221001 (experimental) [remotes/origin/HEAD r13-3010-g2555071] (GCC) 

		=== g++ tests ===


Running target unix/-m32
FAIL: g++.dg/warn/Wstringop-overflow-4.C  -std=gnu++98 (test for excess errors)
FAIL: c-c++-common/goacc/struct-component-kind-1.c  -std=c++14  at line 68 (test for errors, line 67)
FAIL: c-c++-common/goacc/struct-component-kind-1.c  -std=c++17  at line 68 (test for errors, line 67)
FAIL: c-c++-common/goacc/struct-component-kind-1.c  -std=c++20  at line 68 (test for errors, line 67)
FAIL: c-c++-common/goacc/struct-component-kind-1.c  -std=c++98  at line 68 (test for errors, line 67)
FAIL: g++.dg/tls/thread_local-order2.C  -std=c++14 execution test
FAIL: g++.dg/tls/thread_local-order2.C  -std=c++17 execution test
FAIL: g++.dg/tls/thread_local-order2.C  -std=c++20 execution test

		=== g++ Summary for unix/-m32 ===


Running target unix/-m64
FAIL: c-c++-common/asan/swapcontext-test-1.c   -O0  execution test
FAIL: c-c++-common/asan/swapcontext-test-1.c   -O1  execution test
FAIL: c-c++-common/asan/swapcontext-test-1.c   -O2  execution test
FAIL: c-c++-common/asan/swapcontext-test-1.c   -O2 -flto -fno-use-linker-plugin -flto-partition=none  execution test
FAIL: c-c++-common/asan/swapcontext-test-1.c   -O2 -flto -fuse-linker-plugin -fno-fat-lto-objects  execution test
FAIL: c-c++-common/asan/swapcontext-test-1.c   -O3 -fomit-frame-pointer -funroll-loops -fpeel-loops -ftracer -finline-functions  execution test
FAIL: c-c++-common/asan/swapcontext-test-1.c   -O3 -g  execution test
FAIL: c-c++-common/asan/swapcontext-test-1.c   -Os  execution test
FAIL: c-c++-common/goacc/struct-component-kind-1.c  -std=c++14  at line 68 (test for errors, line 67)
FAIL: c-c++-common/goacc/struct-component-kind-1.c  -std=c++17  at line 68 (test for errors, line 67)
FAIL: c-c++-common/goacc/struct-component-kind-1.c  -std=c++20  at line 68 (test for errors, line 67)
FAIL: c-c++-common/goacc/struct-component-kind-1.c  -std=c++98  at line 68 (test for errors, line 67)
FAIL: g++.dg/tls/thread_local-order2.C  -std=c++14 execution test
FAIL: g++.dg/tls/thread_local-order2.C  -std=c++17 execution test
FAIL: g++.dg/tls/thread_local-order2.C  -std=c++20 execution test
WARNING: ThreadSanitizer: data race (pid=17479)
WARNING: ThreadSanitizer: data race (pid=17637)
FAIL: c-c++-common/tsan/race_on_mutex.c   -O0  output pattern test, is ==================
FAIL: c-c++-common/tsan/race_on_mutex.c   -O2  output pattern test, is ==================
FAIL: g++.dg/tsan/pthread_cond_clockwait.C   -O0  (test for excess errors)
UNRESOLVED: g++.dg/tsan/pthread_cond_clockwait.C   -O0  compilation failed to produce executable
FAIL: g++.dg/tsan/pthread_cond_clockwait.C   -O2  (test for excess errors)
UNRESOLVED: g++.dg/tsan/pthread_cond_clockwait.C   -O2  compilation failed to produce executable

		=== g++ Summary for unix/-m64 ===


		=== g++ Summary ===

/home/gccbuild/build/nightly/build-gcc-trunk/gcc/testsuite/g++/../../xg++  version 13.0.0 20221001 (experimental) [remotes/origin/HEAD r13-3010-g2555071] (GCC) 

		=== obj-c++ tests ===


Running target unix/-m32

		=== obj-c++ Summary for unix/-m32 ===

# of expected passes		56

Running target unix/-m64

		=== obj-c++ Summary for unix/-m64 ===

# of expected passes		56

		=== obj-c++ Summary ===

# of expected passes		3012
# of expected failures		12
# of unsupported tests		158
/home/gccbuild/build/nightly/build-gcc-trunk/gcc/testsuite/obj-c++/../../xg++  version 13.0.0 20221001 (experimental) [remotes/origin/HEAD r13-3010-g2555071] (GCC) 

		=== objc tests ===


Running target unix/-m32

		=== objc Summary for unix/-m32 ===

# of expected passes		56

Running target unix/-m64

		=== objc Summary for unix/-m64 ===

# of expected passes		56

		=== objc Summary ===

# of expected passes		112
/home/gccbuild/build/nightly/build-gcc-trunk/gcc/xgcc  version 13.0.0 20221001 (experimental) [remotes/origin/HEAD r13-3010-g2555071] (GCC) 

		=== libatomic tests ===


Running target unix/-m32

		=== libatomic Summary for unix/-m32 ===

# of expected passes		44
# of unsupported tests		5

Running target unix/-m64

		=== libatomic Summary for unix/-m64 ===

# of expected passes		54

		=== libatomic Summary ===

# of expected passes		98
# of unsupported tests		5
		=== libgomp tests ===


Running target unix/-m32

		=== libgomp Summary for unix/-m32 ===

# of expected passes		5337
# of expected failures		162
# of unsupported tests		146

Running target unix/-m64

		=== libgomp Summary for unix/-m64 ===

# of expected passes		5337
# of expected failures		162
# of unsupported tests		146

		=== libgomp Summary ===

# of expected passes		28010
# of expected failures		426
# of unsupported tests		1304
		=== libitm tests ===


Running target unix/-m32

		=== libitm Summary for unix/-m32 ===

# of expected passes		18
# of expected failures		1
# of unsupported tests		1

Running target unix/-m64

		=== libitm Summary for unix/-m64 ===

# of expected passes		18
# of expected failures		1
# of unsupported tests		1

		=== libitm Summary ===

# of expected passes		88
# of expected failures		6
# of unsupported tests		2
		=== libstdc++ tests ===


Running target unix/-m32

		=== libstdc++ Summary for unix/-m32 ===

# of unsupported tests		1

Running target unix/-m64

		=== libstdc++ Summary for unix/-m64 ===

# of unsupported tests		1

		=== libstdc++ Summary ===

# of unsupported tests		2

Compiler version: 13.0.0 20221001 (experimental) [remotes/origin/HEAD r13-3010-g2555071] (GCC) 
Platform: powerpc64-unknown-linux-gnu
configure flags: --prefix=/opt/gcc-nightly/trunk --with-as=/home/gccbuild/binutils/install/bin/as --with-ld=/home/gccbuild/binutils/install/bin/ld --enable-languages=c,c++,fortran,objc,obj-c++ --enable-multilib --with-cpu=power8
fail   WARNING: Could not generate test framework tests
fail   XPASS: gcc.test-framework/dg-bogus-exp-XF.c (test for excess errors)
fail   FAIL: gcc.test-framework/dg-do-assemble-exp-P.c (test for excess errors) (PRMS 42)
fail   FAIL: gcc.test-framework/dg-do-compile-exp-P.c (test for excess errors) (PRMS 42)
fail   FAIL: gcc.test-framework/dg-do-link-exp-P.c (test for excess errors) (PRMS 42)
fail   FAIL: gcc.test-framework/dg-do-run-exp-P.c (test for excess errors) (PRMS 42)
fail   FAIL: gcc.test-framework/dg-dot-run-exp-P.c (test for excess errors) (PRMS 42)
fail   FAIL: gcc.test-framework/dg-dox-run-exp-XF.c (test for excess errors) (PRMS 42)
fail   FAIL: gcc.test-framework/dg-output-exp-P.c (test for excess errors) (PRMS 42)
fail   FAIL: gcc.test-framework/dg-output-exp-XF.c (test for excess errors) (PRMS 42)
fail   ERROR: gcc.test-framework/dg-scan-symbol-section-1-exp-F.S: error executing dg-final: syntax error in target selector ""
fail   UNRESOLVED: gcc.test-framework/dg-scan-symbol-section-1-exp-F.S: error executing dg-final: syntax error in target selector "" (PRMS 42)
fail   ERROR: gcc.test-framework/dg-scan-symbol-section-2-exp-F.S: error executing dg-final: syntax error in target selector ""
fail   UNRESOLVED: gcc.test-framework/dg-scan-symbol-section-2-exp-F.S: error executing dg-final: syntax error in target selector "" (PRMS 42)
fail   ERROR: gcc.test-framework/dg-scan-symbol-section-3-exp-F.S: error executing dg-final: syntax error in target selector ""
fail   UNRESOLVED: gcc.test-framework/dg-scan-symbol-section-3-exp-F.S: error executing dg-final: syntax error in target selector "" (PRMS 42)
fail   ERROR: gcc.test-framework/dg-scan-symbol-section-exp-P.S: error executing dg-final: syntax error in target selector ""
fail   UNRESOLVED: gcc.test-framework/dg-scan-symbol-section-exp-P.S: error executing dg-final: syntax error in target selector "" (PRMS 42)
fail   FAIL: gcc.test-framework/dg-warning-exp-P.c warning test (test for warnings, line 9) (PRMS 42)

		=== Test Framework Summary ===

# of expected passes		68
# of unexpected failures	19


                 reply	other threads:[~2022-10-01  9:14 UTC|newest]

Thread overview: [no followups] expand[flat|nested]  mbox.gz  Atom feed

Reply instructions:

You may reply publicly to this message via plain-text email
using any one of the following methods:

* Save the following mbox file, import it into your mail client,
  and reply-to-all from there: mbox

  Avoid top-posting and favor interleaved quoting:
  https://en.wikipedia.org/wiki/Posting_style#Interleaved_style

* Reply using the --to, --cc, and --in-reply-to
  switches of git-send-email(1):

  git send-email \
    --in-reply-to=20221001091419.GA79205@makalu-lp1.aus.stglabs.ibm.com \
    --to=seurer@linux.ibm.com \
    --cc=gcc-testresults@gcc.gnu.org \
    /path/to/YOUR_REPLY

  https://kernel.org/pub/software/scm/git/docs/git-send-email.html

* If your mail client supports setting the In-Reply-To header
  via mailto: links, try the mailto: link
Be sure your reply has a Subject: header at the top and a blank line before the message body.
This is a public inbox, see mirroring instructions
for how to clone and mirror all data and code used for this inbox;
as well as URLs for read-only IMAP folder(s) and NNTP newsgroup(s).