public inbox for gdb-testers@sourceware.org
help / color / mirror / Atom feed
* GNU gdb (GDB) 13.0.50.20220913-git ppc64le-ibm-linux-gnu GIT commit: 77c2f1aad10656edc774eb962937b778e78d1a37
@ 2022-09-13  7:30 Will Schmidt [POWER10]
  0 siblings, 0 replies; 2+ messages in thread
From: Will Schmidt [POWER10] @ 2022-09-13  7:30 UTC (permalink / raw)
  To: gdb-testers

Test run by gdb-buildbot on Tue Sep 13 03:01:38 2022
Native configuration is powerpc64le-unknown-linux-gnu

		=== gdb tests ===

Schedule of variations:
    unix

FAIL: gdb.ada/O2_float_param.exp: scenario=all: frame
FAIL: gdb.ada/O2_float_param.exp: scenario=minimal: frame
FAIL: gdb.ada/array_return.exp: value printed by finish of Create_Small_Float_Vector
FAIL: gdb.ada/float-bits.exp: print 16llf#4000921fb54442d18469898cc51701b8#
FAIL: gdb.ada/float-bits.exp: print $foo:=16llf#4000921fb54442d18469898cc51701b8#
FAIL: gdb.ada/float-bits.exp: print internal long double variable after assignment
FAIL: gdb.ada/inline-section-gc.exp: break callee.adb:22
FAIL: gdb.ada/mi_var_access.exp: Create varobj (unexpected output)
FAIL: gdb.ada/mi_var_access.exp: update at stop 2 (unexpected output)
FAIL: gdb.ada/ptype_tagged_param.exp: ptype s, without debug info
DUPLICATE: gdb.arch/ppc-fp.exp: next
FAIL: gdb.base/annota1.exp: continue to printf
FAIL: gdb.base/annota1.exp: backtrace from shlibrary (timeout)
FAIL: gdb.base/annota1.exp: send SIGUSR1 (timeout)
FAIL: gdb.base/annota1.exp: backtrace @ signal handler (timeout)
FAIL: gdb.base/annota1.exp: set up display (timeout)
FAIL: gdb.base/annota1.exp: re-run
FAIL: gdb.base/annota3.exp: continue to printf (pattern 4)
FAIL: gdb.base/annota3.exp: backtrace from shlibrary (pattern 2)
FAIL: gdb.base/annota3.exp: send SIGUSR1 (pattern 2)
FAIL: gdb.base/annota3.exp: backtrace @ signal handler (pattern 1)
FAIL: gdb.base/annota3.exp: set up display (pattern 2 + sentinel)
FAIL: gdb.base/annota3.exp: re-run
WARNING: can't generate a core file - core tests suppressed - check ulimit -c
WARNING: can't generate a core file - core tests suppressed - check ulimit -c
WARNING: can't generate a core file - core tests suppressed - check ulimit -c
WARNING: can't generate a core file - core tests suppressed - check ulimit -c
WARNING: can't generate a core file - core tests suppressed - check ulimit -c
WARNING: can't generate a core file - core tests suppressed - check ulimit -c
WARNING: can't generate a core file - core tests suppressed - check ulimit -c
WARNING: can't generate a core file - core tests suppressed - check ulimit -c
WARNING: can't generate a core file - core tests suppressed - check ulimit -c
WARNING: can't generate a core file - core tests suppressed - check ulimit -c
WARNING: can't generate a core file - core tests suppressed - check ulimit -c
WARNING: can't generate a core file - core tests suppressed - check ulimit -c
WARNING: can't generate a core file - core tests suppressed - check ulimit -c
FAIL: gdb.base/complex-parts.exp: ptype z3
WARNING: can't generate a core file - core tests suppressed - check ulimit -c
WARNING: can't generate a core file - core tests suppressed - check ulimit -c
WARNING: can't generate a core file - core tests suppressed - check ulimit -c
WARNING: can't generate a core file - core tests suppressed - check ulimit -c
WARNING: can't generate a core file - core tests suppressed - check ulimit -c
WARNING: can't generate a core file - core tests suppressed - check ulimit -c
FAIL: gdb.base/ctf-constvars.exp: print vox
FAIL: gdb.base/ctf-constvars.exp: ptype vox
FAIL: gdb.base/ctf-constvars.exp: print victuals
FAIL: gdb.base/ctf-constvars.exp: ptype victuals
FAIL: gdb.base/ctf-constvars.exp: print vixen
FAIL: gdb.base/ctf-constvars.exp: ptype vixen
FAIL: gdb.base/ctf-constvars.exp: print vitriol
FAIL: gdb.base/ctf-constvars.exp: ptype vitriol
FAIL: gdb.base/ctf-constvars.exp: print vellum
FAIL: gdb.base/ctf-constvars.exp: ptype vellum
FAIL: gdb.base/ctf-constvars.exp: print valve
FAIL: gdb.base/ctf-constvars.exp: ptype valve
FAIL: gdb.base/ctf-constvars.exp: print vacuity
FAIL: gdb.base/ctf-constvars.exp: ptype vacuity
FAIL: gdb.base/ctf-constvars.exp: print vertigo
FAIL: gdb.base/ctf-constvars.exp: ptype vertigo
FAIL: gdb.base/ctf-constvars.exp: print laconic
FAIL: gdb.base/ctf-constvars.exp: ptype vampire
FAIL: gdb.base/ctf-constvars.exp: ptype viper
FAIL: gdb.base/ctf-constvars.exp: ptype vigour
FAIL: gdb.base/ctf-constvars.exp: ptype vapour
FAIL: gdb.base/ctf-constvars.exp: ptype ventricle
FAIL: gdb.base/ctf-constvars.exp: ptype vigintillion
FAIL: gdb.base/ctf-constvars.exp: ptype vocation
FAIL: gdb.base/ctf-constvars.exp: ptype veracity
FAIL: gdb.base/ctf-constvars.exp: ptype vapidity
FAIL: gdb.base/ctf-constvars.exp: ptype velocity
FAIL: gdb.base/ctf-constvars.exp: ptype veneer
FAIL: gdb.base/ctf-constvars.exp: ptype video
FAIL: gdb.base/ctf-constvars.exp: ptype vacuum
FAIL: gdb.base/ctf-constvars.exp: ptype veniality
FAIL: gdb.base/ctf-constvars.exp: ptype vitality
FAIL: gdb.base/ctf-constvars.exp: ptype voracity
FAIL: gdb.base/ctf-constvars.exp: ptype violent
FAIL: gdb.base/ctf-constvars.exp: ptype violet
FAIL: gdb.base/ctf-constvars.exp: ptype vips
FAIL: gdb.base/ctf-constvars.exp: ptype virgen
FAIL: gdb.base/ctf-constvars.exp: ptype vulgar
FAIL: gdb.base/ctf-constvars.exp: ptype vulture
FAIL: gdb.base/ctf-constvars.exp: ptype vilify
FAIL: gdb.base/ctf-constvars.exp: ptype villar
FAIL: gdb.base/ctf-constvars.exp: print victor
FAIL: gdb.base/ctf-constvars.exp: ptype victor
FAIL: gdb.base/ctf-constvars.exp: ptype victory
FAIL: gdb.base/ctf-constvars.exp: ptype cavern
FAIL: gdb.base/ctf-constvars.exp: ptype caveat
FAIL: gdb.base/ctf-constvars.exp: ptype covenant
FAIL: gdb.base/ctf-constvars.exp: ptype vanadium
FAIL: gdb.base/ctf-constvars.exp: ptype cove
FAIL: gdb.base/ctf-constvars.exp: ptype cavity
FAIL: gdb.base/ctf-constvars.exp: ptype vagus
FAIL: gdb.base/ctf-constvars.exp: ptype vagrancy
FAIL: gdb.base/ctf-constvars.exp: ptype vagary
FAIL: gdb.base/ctf-constvars.exp: ptype vendor
FAIL: gdb.base/ctf-constvars.exp: ptype vindictive
FAIL: gdb.base/ctf-constvars.exp: ptype vegetation
FAIL: gdb.base/ctf-ptype.exp: ptype v_struct1.v_float_member
FAIL: gdb.base/ctf-ptype.exp: ptype v_struct1->v_float_member
FAIL: gdb.base/ctf-ptype.exp: ptype v_t_struct_p.v_float_member
FAIL: gdb.base/ctf-ptype.exp: ptype v_t_struct_p->v_float_member
FAIL: gdb.base/ctf-ptype.exp: ptype unnamed enumeration
FAIL: gdb.base/ctf-ptype.exp: ptype char array
FAIL: gdb.base/ctf-ptype.exp: ptype signed char array
FAIL: gdb.base/ctf-ptype.exp: ptype unsigned char array
FAIL: gdb.base/ctf-ptype.exp: ptype int array
FAIL: gdb.base/ctf-ptype.exp: ptype signed int array
FAIL: gdb.base/ctf-ptype.exp: ptype unsigned int array
FAIL: gdb.base/ctf-ptype.exp: ptype long array
FAIL: gdb.base/ctf-ptype.exp: ptype signed long array
FAIL: gdb.base/ctf-ptype.exp: ptype unsigned long array
FAIL: gdb.base/ctf-ptype.exp: ptype float array
FAIL: gdb.base/ctf-ptype.exp: ptype double array
FAIL: gdb.base/ctf-ptype.exp: ptype pv_char_array
FAIL: gdb.base/ctf-ptype.exp: ptype char pointer
FAIL: gdb.base/ctf-ptype.exp: ptype short pointer
FAIL: gdb.base/ctf-ptype.exp: ptype long pointer
FAIL: gdb.base/ctf-ptype.exp: ptype int pointer
FAIL: gdb.base/ctf-ptype.exp: ptype signed long pointer
FAIL: gdb.base/ctf-ptype.exp: ptype unsigned long pointer
FAIL: gdb.base/ctf-ptype.exp: ptype float pointer
FAIL: gdb.base/ctf-ptype.exp: ptype double pointer
FAIL: gdb.base/ctf-ptype.exp: ptype short
FAIL: gdb.base/ctf-ptype.exp: ptype int
FAIL: gdb.base/ctf-ptype.exp: ptype nested structure
FAIL: gdb.base/ctf-ptype.exp: ptype outer int
FAIL: gdb.base/ctf-ptype.exp: ptype nested structure #2
FAIL: gdb.base/ctf-ptype.exp: ptype inner int
FAIL: gdb.base/ctf-ptype.exp: ptype nested union
FAIL: gdb.base/ctf-ptype.exp: ptype the_highest
FAIL: gdb.base/ctf-ptype.exp: ptype the_highest.anonymous_level_1
FAIL: gdb.base/ctf-ptype.exp: ptype old_fptr
FAIL: gdb.base/ctf-ptype.exp: ptype new_fptr
FAIL: gdb.base/ctf-ptype.exp: ptype fptr
FAIL: gdb.base/ctf-ptype.exp: ptype fptr2
FAIL: gdb.base/ctf-ptype.exp: ptype xptr
FAIL: gdb.base/ctf-ptype.exp: ptype ffptr
FAIL: gdb.base/ctf-ptype.exp: ptype fffptr
gdb compile failed, gcc: error: unrecognized debug output level 't'
FAIL: gdb.base/gdb-sigterm.exp: pass=0: expect eof (GDB internal error)
ERROR: Could not resync from internal error (recursive internal problem)
UNRESOLVED: gdb.base/gdb-sigterm.exp: 50 SIGTERM passes
gdb compile failed, /gdb/testsuite/gdb.base/gdbindex-stabs.c: warning: STABS debugging information is obsolete and not supported anymore
FAIL: gdb.base/inline-frame-cycle-unwind.exp: cycle at level 5: backtrace when the unwind is broken at frame 5
FAIL: gdb.base/inline-frame-cycle-unwind.exp: cycle at level 3: backtrace when the unwind is broken at frame 3
FAIL: gdb.base/inline-frame-cycle-unwind.exp: cycle at level 1: backtrace when the unwind is broken at frame 1
WARNING: can't generate a core file - core tests suppressed - check ulimit -c
FAIL: gdb.base/retval-large-struct.exp: finish from return_large_struct
FAIL: gdb.base/store.exp: var doublest l; print old l, expecting -1
FAIL: gdb.base/store.exp: var doublest l; print old r, expecting -2
FAIL: gdb.base/store.exp: var doublest l; print incremented l, expecting 2
FAIL: gdb.base/store.exp: upvar doublest l; print old l, expecting -1
FAIL: gdb.base/store.exp: upvar doublest l; print old r, expecting -2
FAIL: gdb.base/varargs.exp: print find_max_long_double_real(4, ldc1, ldc2, ldc3, ldc4)
FAIL: gdb.base/vla-optimized-out.exp: o1: printed size of optimized out vla
DUPLICATE: gdb.base/watchpoint-unaligned.exp: rwatch data.u.size1[3] (PRMS breakpoints/23131)
DUPLICATE: gdb.base/watchpoint-unaligned.exp: rwatch data.u.size1[4] (PRMS breakpoints/23131)
FAIL: gdb.base/watchpoint.exp: next over global_ptr_ptr buffer set
FAIL: gdb.base/watchpoint.exp: next over global_ptr_ptr pointer advance
FAIL: gdb.base/whatis-ptype-typedefs.exp: lang=c: whatis/ptype: ptype long_double_typedef
FAIL: gdb.base/whatis-ptype-typedefs.exp: lang=c: whatis/ptype: ptype long_double_typedef2
FAIL: gdb.base/whatis-ptype-typedefs.exp: lang=c: whatis/ptype: ptype v_long_double_typedef
FAIL: gdb.base/whatis-ptype-typedefs.exp: lang=c: whatis/ptype: ptype v_long_double_typedef2
FAIL: gdb.base/whatis-ptype-typedefs.exp: lang=c: cast: ptype (long_double_typedef) v_int_typedef
FAIL: gdb.base/whatis-ptype-typedefs.exp: lang=c: cast: ptype (long_double_typedef2) v_int_typedef
FAIL: gdb.base/whatis-ptype-typedefs.exp: lang=c: cast: ptype (long_double_typedef) v_int_typedef2
FAIL: gdb.base/whatis-ptype-typedefs.exp: lang=c: cast: ptype (long_double_typedef2) v_int_typedef2
FAIL: gdb.base/whatis-ptype-typedefs.exp: lang=c: cast: ptype (long_double_typedef) v_float_typedef
FAIL: gdb.base/whatis-ptype-typedefs.exp: lang=c: cast: ptype (long_double_typedef2) v_float_typedef
FAIL: gdb.base/whatis-ptype-typedefs.exp: lang=c: cast: ptype (long_double_typedef) v_float_typedef2
FAIL: gdb.base/whatis-ptype-typedefs.exp: lang=c: cast: ptype (long_double_typedef2) v_float_typedef2
FAIL: gdb.base/whatis-ptype-typedefs.exp: lang=c: cast: ptype (long_double_typedef) v_double_typedef
FAIL: gdb.base/whatis-ptype-typedefs.exp: lang=c: cast: ptype (long_double_typedef2) v_double_typedef
FAIL: gdb.base/whatis-ptype-typedefs.exp: lang=c: cast: ptype (long_double_typedef) v_double_typedef2
FAIL: gdb.base/whatis-ptype-typedefs.exp: lang=c: cast: ptype (long_double_typedef2) v_double_typedef2
FAIL: gdb.base/whatis-ptype-typedefs.exp: lang=c: cast: ptype (long_double_typedef) v_long_double_typedef
FAIL: gdb.base/whatis-ptype-typedefs.exp: lang=c: cast: ptype (long_double_typedef2) v_long_double_typedef
FAIL: gdb.base/whatis-ptype-typedefs.exp: lang=c: cast: ptype (long_double_typedef) v_long_double_typedef2
FAIL: gdb.base/whatis-ptype-typedefs.exp: lang=c: cast: ptype (long_double_typedef2) v_long_double_typedef2
FAIL: gdb.base/whatis-ptype-typedefs.exp: lang=c: cast: ptype (long_double_typedef) v_colors_typedef
FAIL: gdb.base/whatis-ptype-typedefs.exp: lang=c: cast: ptype (long_double_typedef2) v_colors_typedef
FAIL: gdb.base/whatis-ptype-typedefs.exp: lang=c: cast: ptype (long_double_typedef) v_colors_typedef2
FAIL: gdb.base/whatis-ptype-typedefs.exp: lang=c: cast: ptype (long_double_typedef2) v_colors_typedef2
FAIL: gdb.base/whatis-ptype-typedefs.exp: lang=c: cast: ptype (long_double_typedef) v_func_ftype
FAIL: gdb.base/whatis-ptype-typedefs.exp: lang=c: cast: ptype (long_double_typedef2) v_func_ftype
FAIL: gdb.base/whatis-ptype-typedefs.exp: lang=c: cast: ptype (long_double_typedef) v_func_ftype2
FAIL: gdb.base/whatis-ptype-typedefs.exp: lang=c: cast: ptype (long_double_typedef2) v_func_ftype2
FAIL: gdb.base/whatis-ptype-typedefs.exp: lang=c: cast: ptype (long_double_typedef) v_t_struct_typedef
FAIL: gdb.base/whatis-ptype-typedefs.exp: lang=c: cast: ptype (long_double_typedef2) v_t_struct_typedef
FAIL: gdb.base/whatis-ptype-typedefs.exp: lang=c: cast: ptype (long_double_typedef) v_t_struct_typedef2
FAIL: gdb.base/whatis-ptype-typedefs.exp: lang=c: cast: ptype (long_double_typedef2) v_t_struct_typedef2
FAIL: gdb.base/whatis-ptype-typedefs.exp: lang=c: cast: ptype (long_double_typedef) v_t_struct_union_wrapper_typedef
FAIL: gdb.base/whatis-ptype-typedefs.exp: lang=c: cast: ptype (long_double_typedef2) v_t_struct_union_wrapper_typedef
FAIL: gdb.base/whatis-ptype-typedefs.exp: lang=c: cast: ptype (long_double_typedef) v_t_struct_union_wrapper_typedef2
FAIL: gdb.base/whatis-ptype-typedefs.exp: lang=c: cast: ptype (long_double_typedef2) v_t_struct_union_wrapper_typedef2
FAIL: gdb.base/whatis-ptype-typedefs.exp: lang=c++: whatis/ptype: ptype long_double_typedef
FAIL: gdb.base/whatis-ptype-typedefs.exp: lang=c++: whatis/ptype: ptype long_double_typedef2
FAIL: gdb.base/whatis-ptype-typedefs.exp: lang=c++: whatis/ptype: ptype v_long_double_typedef
FAIL: gdb.base/whatis-ptype-typedefs.exp: lang=c++: whatis/ptype: ptype v_long_double_typedef2
FAIL: gdb.base/whatis-ptype-typedefs.exp: lang=c++: cast: ptype (long_double_typedef) v_int_typedef
FAIL: gdb.base/whatis-ptype-typedefs.exp: lang=c++: cast: ptype (long_double_typedef2) v_int_typedef
FAIL: gdb.base/whatis-ptype-typedefs.exp: lang=c++: cast: ptype (long_double_typedef) v_int_typedef2
FAIL: gdb.base/whatis-ptype-typedefs.exp: lang=c++: cast: ptype (long_double_typedef2) v_int_typedef2
FAIL: gdb.base/whatis-ptype-typedefs.exp: lang=c++: cast: ptype (long_double_typedef) v_float_typedef
FAIL: gdb.base/whatis-ptype-typedefs.exp: lang=c++: cast: ptype (long_double_typedef2) v_float_typedef
FAIL: gdb.base/whatis-ptype-typedefs.exp: lang=c++: cast: ptype (long_double_typedef) v_float_typedef2
FAIL: gdb.base/whatis-ptype-typedefs.exp: lang=c++: cast: ptype (long_double_typedef2) v_float_typedef2
FAIL: gdb.base/whatis-ptype-typedefs.exp: lang=c++: cast: ptype (long_double_typedef) v_double_typedef
FAIL: gdb.base/whatis-ptype-typedefs.exp: lang=c++: cast: ptype (long_double_typedef2) v_double_typedef
FAIL: gdb.base/whatis-ptype-typedefs.exp: lang=c++: cast: ptype (long_double_typedef) v_double_typedef2
FAIL: gdb.base/whatis-ptype-typedefs.exp: lang=c++: cast: ptype (long_double_typedef2) v_double_typedef2
FAIL: gdb.base/whatis-ptype-typedefs.exp: lang=c++: cast: ptype (long_double_typedef) v_long_double_typedef
FAIL: gdb.base/whatis-ptype-typedefs.exp: lang=c++: cast: ptype (long_double_typedef2) v_long_double_typedef
FAIL: gdb.base/whatis-ptype-typedefs.exp: lang=c++: cast: ptype (long_double_typedef) v_long_double_typedef2
FAIL: gdb.base/whatis-ptype-typedefs.exp: lang=c++: cast: ptype (long_double_typedef2) v_long_double_typedef2
FAIL: gdb.base/whatis-ptype-typedefs.exp: lang=c++: cast: ptype (long_double_typedef) v_colors_typedef
FAIL: gdb.base/whatis-ptype-typedefs.exp: lang=c++: cast: ptype (long_double_typedef2) v_colors_typedef
FAIL: gdb.base/whatis-ptype-typedefs.exp: lang=c++: cast: ptype (long_double_typedef) v_colors_typedef2
FAIL: gdb.base/whatis-ptype-typedefs.exp: lang=c++: cast: ptype (long_double_typedef2) v_colors_typedef2
FAIL: gdb.base/whatis-ptype-typedefs.exp: lang=c++: cast: ptype (long_double_typedef) v_func_ftype
FAIL: gdb.base/whatis-ptype-typedefs.exp: lang=c++: cast: ptype (long_double_typedef2) v_func_ftype
FAIL: gdb.base/whatis-ptype-typedefs.exp: lang=c++: cast: ptype (long_double_typedef) v_func_ftype2
FAIL: gdb.base/whatis-ptype-typedefs.exp: lang=c++: cast: ptype (long_double_typedef2) v_func_ftype2
FAIL: gdb.base/whatis-ptype-typedefs.exp: lang=c++: cast: ptype (long_double_typedef) v_t_struct_typedef
FAIL: gdb.base/whatis-ptype-typedefs.exp: lang=c++: cast: ptype (long_double_typedef2) v_t_struct_typedef
FAIL: gdb.base/whatis-ptype-typedefs.exp: lang=c++: cast: ptype (long_double_typedef) v_t_struct_typedef2
FAIL: gdb.base/whatis-ptype-typedefs.exp: lang=c++: cast: ptype (long_double_typedef2) v_t_struct_typedef2
FAIL: gdb.base/whatis-ptype-typedefs.exp: lang=c++: cast: ptype (long_double_typedef) v_t_struct_union_wrapper_typedef
FAIL: gdb.base/whatis-ptype-typedefs.exp: lang=c++: cast: ptype (long_double_typedef2) v_t_struct_union_wrapper_typedef
FAIL: gdb.base/whatis-ptype-typedefs.exp: lang=c++: cast: ptype (long_double_typedef) v_t_struct_union_wrapper_typedef2
FAIL: gdb.base/whatis-ptype-typedefs.exp: lang=c++: cast: ptype (long_double_typedef2) v_t_struct_union_wrapper_typedef2
FAIL: gdb.base/whatis-ptype-typedefs.exp: lang=c++: cast: ptype (long_double_typedef) v_ns_Struct_typedef
FAIL: gdb.base/whatis-ptype-typedefs.exp: lang=c++: cast: ptype (long_double_typedef2) v_ns_Struct_typedef
gdb compile failed, gcc: error: unrecognized debug output level 't'
FAIL: gdb.compile/compile-cplus-method.exp: compile code a->get_var ()
FAIL: gdb.compile/compile-cplus-method.exp: result of compile code a->get_var ()
FAIL: gdb.compile/compile-cplus-method.exp: compile code a->get_var (static_cast<unsigned long> (1))
FAIL: gdb.compile/compile-cplus-method.exp: result of compile code a->get_var (static_cast<unsigned long> (1))
FAIL: gdb.compile/compile-cplus-method.exp: compile code a->get_var (static_cast<int> (1))
FAIL: gdb.compile/compile-cplus-method.exp: result of compile code a->get_var (static_cast<int> (1))
FAIL: gdb.compile/compile-cplus-method.exp: compile code a->get_var (static_cast<float> (1))
FAIL: gdb.compile/compile-cplus-method.exp: result of compile code a->get_var (static_cast<float> (1))
FAIL: gdb.compile/compile-cplus-method.exp: compile code a->get_var (static_cast<void *> (a))
FAIL: gdb.compile/compile-cplus-method.exp: result of compile code a->get_var (static_cast<void *> (a))
FAIL: gdb.compile/compile-cplus-method.exp: compile code a->get_var (*a)
FAIL: gdb.compile/compile-cplus-method.exp: result of compile code a->get_var (*a)
FAIL: gdb.compile/compile-cplus-method.exp: compile code a->get_var (*ac)
FAIL: gdb.compile/compile-cplus-method.exp: result of compile code a->get_var (*ac)
FAIL: gdb.compile/compile-cplus-method.exp: compile code a->get_var1 (1)
FAIL: gdb.compile/compile-cplus-method.exp: result of compile code a->get_var1 (1)
FAIL: gdb.compile/compile-cplus-method.exp: compile code a->get_var2 (1, 2)
FAIL: gdb.compile/compile-cplus-method.exp: result of compile code a->get_var2 (1, 2)
FAIL: gdb.compile/compile-cplus-method.exp: compile code A::get_1 (a->get_var ())
FAIL: gdb.compile/compile-cplus-method.exp: result of compile code A::get_1 (a->get_var ())
FAIL: gdb.compile/compile-cplus-method.exp: compile code a->get_var1 (a->get_var () - 16)
FAIL: gdb.compile/compile-cplus-method.exp: result of compile code a->get_var1 (a->get_var () - 16)
FAIL: gdb.compile/compile-cplus-method.exp: compile code a->get_var2 (a->get_var (), A::get_1 (2))
FAIL: gdb.compile/compile-cplus-method.exp: result of compile code a->get_var2 (a->get_var (), A::get_1 (2))
FAIL: gdb.compile/compile-cplus-method.exp: compile code get_value (a)
FAIL: gdb.compile/compile-cplus-method.exp: result of compile code get_value (a)
FAIL: gdb.compile/compile-cplus-method.exp: compile code (a->*pmf) (1)
FAIL: gdb.compile/compile-cplus-method.exp: result of compile code (a->*pmf) (1)
FAIL: gdb.compile/compile-cplus-method.exp: compile code pmf = &A::get_var1; var = (a->*pmf) (2); pmf = &A::get_var
FAIL: gdb.compile/compile-cplus-method.exp: result of compile code pmf = &A::get_var1; var = (a->*pmf) (2); pmf = &A::get_var
FAIL: gdb.compile/compile-cplus-method.exp: compile code (a->**pmf_p) (1)
FAIL: gdb.compile/compile-cplus-method.exp: result of compile code (a->**pmf_p) (1)
FAIL: gdb.compile/compile-cplus-virtual.exp: compile code ap->doit ()
FAIL: gdb.compile/compile-cplus-virtual.exp: compile code ap->doit2 ()
FAIL: gdb.compile/compile-cplus.exp: compile code extern int globalshadow; globalshadow += 5;
FAIL: gdb.compile/compile-cplus.exp: print 'compile-cplus.c'::globalshadow
FAIL: gdb.compile/compile-setjmp.exp: compile file -r
FAIL: gdb.compile/compile-setjmp.exp: p done
gdb compile failed, /usr/bin/ld: cannot find -lstdc++
collect2: error: ld returned 1 exit status
gdb compile failed, /usr/bin/ld: cannot find -lstdc++
collect2: error: ld returned 1 exit status
gdb compile failed, /usr/bin/ld: cannot find -lstdc++
collect2: error: ld returned 1 exit status
FAIL: gdb.cp/gdb2495.exp: call a function that raises an exception without a handler.
FAIL: gdb.cp/gdb2495.exp: bt after returning from a popped frame
FAIL: gdb.cp/non-trivial-retval.exp: finish from f1
FAIL: gdb.cp/non-trivial-retval.exp: finish from f2
FAIL: gdb.cp/non-trivial-retval.exp: finish from f22
FAIL: gdb.cp/non-trivial-retval.exp: finish from f3
FAIL: gdb.cp/non-trivial-retval.exp: finish from f4
FAIL: gdb.cp/typeid.exp: before starting: print &typeid(i)
FAIL: gdb.cp/typeid.exp: before starting: print &typeid(i) == &typeid(typeof(i))
FAIL: gdb.cp/typeid.exp: before starting: print &typeid(cp)
FAIL: gdb.cp/typeid.exp: before starting: print &typeid(cp) == &typeid(typeof(cp))
FAIL: gdb.cp/typeid.exp: before starting: print &typeid(ccp)
FAIL: gdb.cp/typeid.exp: before starting: print &typeid(ccp) == &typeid(typeof(ccp))
gdb compile failed, /gdb/testsuite/gdb.dwarf2/dw2-ranges-3.c: warning: STABS debugging information is obsolete and not supported anymore
FAIL: gdb.dwarf2/dw2-unspecified-type.exp: p ((int (*) ()) foo) ()
FAIL: gdb.dwarf2/dw2-unspecified-type.exp: p (int) foo ()
WARNING: can't generate a core file - core tests suppressed - check ulimit -c
ERROR: tcl error sourcing /gdb/testsuite/gdb.multi/attach-no-multi-process.exp.
ERROR: tcl error code NONE
ERROR: Timeout waiting for gdbserver response.
    while executing
"error "Timeout waiting for gdbserver response.""
    invoked from within
"expect {
	    -i $server_spawn_id
	    -timeout 120
	    -notransfer
	    -re "Listening on" { }
	    -re "Can't (bind address|listen on socket): Addr..."
    (procedure "gdbserver_start" line 120)
    invoked from within
"gdbserver_start "--multi" """
    (procedure "test" line 24)
    invoked from within
"test $target_non_stop"
    ("uplevel" body line 2)
    invoked from within
"uplevel 1 $body"
    invoked from within
"foreach_with_prefix target_non_stop {off on} {
    test $target_non_stop
}"
    (file "/gdb/testsuite/gdb.multi/attach-no-multi-process.exp" line 89)
    invoked from within
"source /gdb/testsuite/gdb.multi/attach-no-multi-process.exp"
    ("uplevel" body line 1)
    invoked from within
"uplevel #0 source /gdb/testsuite/gdb.multi/attach-no-multi-process.exp"
    invoked from within
"catch "uplevel #0 source $test_file_name" msg"
UNRESOLVED: gdb.multi/attach-no-multi-process.exp: testcase '/gdb/testsuite/gdb.multi/attach-no-multi-process.exp' aborted due to Tcl error
PATH: gdb.multi/attach-no-multi-process.exp: testcase '/gdb/testsuite/gdb.multi/attach-no-multi-process.exp' aborted due to Tcl error
WARNING: Timed out waiting for EOF in server after monitor exit
gdb compile failed, In file included from /usr/include/features.h:514,
                 from /usr/include/bits/libc-header-start.h:33,
                 from /usr/include/stdio.h:27,
                 from /gdb/testsuite/gdb.multi/hangout.c:18:
/usr/include/gnu/stubs.h:8:11: fatal error: gnu/stubs-32.h: No such file or directory
    8 | # include <gnu/stubs-32.h>
      |           ^~~~~~~~~~~~~~~~
compilation terminated.
DUPLICATE: gdb.opt/inline-cmds.exp: finish from marker
FAIL: gdb.reverse/finish-precsave.exp: reverse finish from long_long_func
FAIL: gdb.reverse/finish-precsave.exp: continue to breakpoint: long_func backward
FAIL: gdb.reverse/finish-precsave.exp: reverse finish from long_func
FAIL: gdb.reverse/finish-precsave.exp: continue to breakpoint: int_func backward
FAIL: gdb.reverse/finish-precsave.exp: reverse finish from int_func
FAIL: gdb.reverse/finish-precsave.exp: continue to breakpoint: short_func backward
FAIL: gdb.reverse/finish-precsave.exp: reverse finish from short_func
FAIL: gdb.reverse/finish-precsave.exp: continue to breakpoint: char_func backward
FAIL: gdb.reverse/finish-precsave.exp: reverse finish from char_func
FAIL: gdb.reverse/finish-precsave.exp: continue to breakpoint: void_func backward
FAIL: gdb.reverse/finish-precsave.exp: reverse finish from void_func
FAIL: gdb.reverse/finish-reverse-bkpt.exp: reverse-finish from void_func trips breakpoint at entry
FAIL: gdb.reverse/finish-reverse-bkpt.exp: no spurious proceed after breakpoint stop
FAIL: gdb.reverse/finish-reverse.exp: reverse finish from long_long_func
FAIL: gdb.reverse/finish-reverse.exp: continue to breakpoint: long_func backward
FAIL: gdb.reverse/finish-reverse.exp: reverse finish from long_func
FAIL: gdb.reverse/finish-reverse.exp: continue to breakpoint: int_func backward
FAIL: gdb.reverse/finish-reverse.exp: reverse finish from int_func
FAIL: gdb.reverse/finish-reverse.exp: continue to breakpoint: short_func backward
FAIL: gdb.reverse/finish-reverse.exp: reverse finish from short_func
FAIL: gdb.reverse/finish-reverse.exp: continue to breakpoint: char_func backward
FAIL: gdb.reverse/finish-reverse.exp: reverse finish from char_func
FAIL: gdb.reverse/finish-reverse.exp: continue to breakpoint: void_func backward
FAIL: gdb.reverse/finish-reverse.exp: reverse finish from void_func
FAIL: gdb.reverse/next-reverse-bkpt-over-sr.exp: reverse-next over call trips user breakpoint at function entry
FAIL: gdb.reverse/next-reverse-bkpt-over-sr.exp: stopped at the right callee call
FAIL: gdb.reverse/pipe-reverse.exp: check pipe record
FAIL: gdb.reverse/solib-precsave.exp: reverse-step into solib function one
FAIL: gdb.reverse/solib-precsave.exp: reverse-step within solib function one
FAIL: gdb.reverse/solib-precsave.exp: reverse-step back to main one
FAIL: gdb.reverse/solib-precsave.exp: reverse-step into solib function two
FAIL: gdb.reverse/solib-precsave.exp: reverse-step within solib function two
FAIL: gdb.reverse/solib-reverse.exp: reverse-step into solib function one
FAIL: gdb.reverse/solib-reverse.exp: reverse-step within solib function one
FAIL: gdb.reverse/solib-reverse.exp: reverse-step back to main one
FAIL: gdb.reverse/solib-reverse.exp: reverse-step into solib function two
FAIL: gdb.reverse/solib-reverse.exp: reverse-step within solib function two
gdb compile failed, gcc: error: unrecognized command-line option '-mindirect-branch=thunk'
gcc: error: unrecognized command-line option '-mfunction-return=thunk'
gdb compile failed, /gdb/testsuite/gdb.stabs/gdb11479.c: warning: STABS debugging information is obsolete and not supported anymore
WARNING: can't generate a core file - core tests suppressed - check ulimit -c
WARNING: can't generate a core file - core tests suppressed - check ulimit -c
FAIL: gdb.tui/tui-layout-asm-short-prog.exp: check asm box contents
FAIL: gdb.tui/tui-layout-asm-short-prog.exp: check asm box contents again

		=== gdb Summary ===

# of unexpected core files	1
# of expected passes		104165
# of unexpected failures	300
# of expected failures		224
# of known failures		122
# of unresolved testcases	2
# of untested testcases		46
# of unsupported tests		189
# of paths in test names	1
# of duplicate test names	4
/gdb/gdb version  13.0.50.20220913-git -nw -nx -iex "set height 0" -iex "set width 0" -data-directory /gdb/testsuite/../data-directory 

ERROR: -------------------------------------------
ERROR: in testcase /gdb/testsuite/gdb.multi/attach-no-multi-process.exp
ERROR:  Timeout waiting for gdbserver response.
ERROR:  tcl error code NONE
ERROR:  tcl error info:
Timeout waiting for gdbserver response.
    while executing
"error "Timeout waiting for gdbserver response.""
    invoked from within
"expect {
	    -i $server_spawn_id
	    -timeout 120
	    -notransfer
	    -re "Listening on" { }
	    -re "Can't (bind address|listen on socket): Addr..."
    (procedure "gdbserver_start" line 120)
    invoked from within
"gdbserver_start "--multi" """
    (procedure "test" line 24)
    invoked from within
"test $target_non_stop"
    ("uplevel" body line 2)
    invoked from within
"uplevel 1 $body"
    invoked from within
"foreach_with_prefix target_non_stop {off on} {
    test $target_non_stop
}"
    (file "/gdb/testsuite/gdb.multi/attach-no-multi-process.exp" line 89)
    invoked from within
"source /gdb/testsuite/gdb.multi/attach-no-multi-process.exp"
    ("uplevel" body line 1)
    invoked from within
"uplevel #0 source /gdb/testsuite/gdb.multi/attach-no-multi-process.exp"
    invoked from within
"catch "uplevel #0 source $test_file_name" msg"
--------------------------------------------------
PATH=/usr/bin:/bin

GCC Version

Using built-in specs.
COLLECT_GCC=gcc
COLLECT_LTO_WRAPPER=/usr/libexec/gcc/ppc64le-redhat-linux/12/lto-wrapper
OFFLOAD_TARGET_NAMES=nvptx-none
OFFLOAD_TARGET_DEFAULT=1
Target: ppc64le-redhat-linux
Configured with: ../configure --enable-bootstrap --enable-languages=c,c++,fortran,objc,obj-c++,ada,go,lto --prefix=/usr --mandir=/usr/share/man --infodir=/usr/share/info --with-bugurl=http://bugzilla.redhat.com/bugzilla --enable-shared --enable-threads=posix --enable-checking=release --enable-targets=powerpcle-linux --disable-multilib --with-system-zlib --enable-__cxa_atexit --disable-libunwind-exceptions --enable-gnu-unique-object --enable-linker-build-id --with-gcc-major-version-only --enable-libstdcxx-backtrace --with-linker-hash-style=gnu --enable-plugin --enable-initfini-array --with-isl=/builddir/build/BUILD/gcc-12.2.1-20220819/obj-ppc64le-redhat-linux/isl-install --enable-offload-targets=nvptx-none --without-cuda-driver --enable-offload-defaulted --enable-gnu-indirect-function --enable-secureplt --with-long-double-128 --with-long-double-format=ieee --with-cpu-32=power8 --with-tune-32=power8 --with-cpu-64=power8 --with-tune-64=power8 --build=ppc64le-redhat-linux --with-build-config=bootstrap-lto --enable-link-serialization=1
Thread model: posix
Supported LTO compression algorithms: zlib zstd
gcc version 12.2.1 20220819 (Red Hat 12.2.1-1) (GCC) 

^ permalink raw reply	[flat|nested] 2+ messages in thread

* GNU gdb (GDB) 13.0.50.20220913-git ppc64le-ibm-linux-gnu GIT commit: 77c2f1aad10656edc774eb962937b778e78d1a37
@ 2022-09-13  8:42 Will Schmidt [POWER8E]
  0 siblings, 0 replies; 2+ messages in thread
From: Will Schmidt [POWER8E] @ 2022-09-13  8:42 UTC (permalink / raw)
  To: gdb-testers

Test run by gdb-buildbot on Tue Sep 13 04:05:03 2022
Native configuration is powerpc64le-unknown-linux-gnu

		=== gdb tests ===

Schedule of variations:
    unix

DUPLICATE: gdb.arch/ppc-fp.exp: next
WARNING: can't generate a core file - core tests suppressed - check ulimit -c
WARNING: can't generate a core file - core tests suppressed - check ulimit -c
WARNING: can't generate a core file - core tests suppressed - check ulimit -c
WARNING: can't generate a core file - core tests suppressed - check ulimit -c
WARNING: can't generate a core file - core tests suppressed - check ulimit -c
WARNING: can't generate a core file - core tests suppressed - check ulimit -c
WARNING: can't generate a core file - core tests suppressed - check ulimit -c
WARNING: can't generate a core file - core tests suppressed - check ulimit -c
WARNING: can't generate a core file - core tests suppressed - check ulimit -c
WARNING: can't generate a core file - core tests suppressed - check ulimit -c
WARNING: can't generate a core file - core tests suppressed - check ulimit -c
WARNING: can't generate a core file - core tests suppressed - check ulimit -c
WARNING: can't generate a core file - core tests suppressed - check ulimit -c
WARNING: can't generate a core file - core tests suppressed - check ulimit -c
WARNING: can't generate a core file - core tests suppressed - check ulimit -c
WARNING: can't generate a core file - core tests suppressed - check ulimit -c
WARNING: can't generate a core file - core tests suppressed - check ulimit -c
WARNING: can't generate a core file - core tests suppressed - check ulimit -c
WARNING: can't generate a core file - core tests suppressed - check ulimit -c
FAIL: gdb.base/inline-frame-cycle-unwind.exp: cycle at level 5: backtrace when the unwind is broken at frame 5
FAIL: gdb.base/inline-frame-cycle-unwind.exp: cycle at level 3: backtrace when the unwind is broken at frame 3
FAIL: gdb.base/inline-frame-cycle-unwind.exp: cycle at level 1: backtrace when the unwind is broken at frame 1
WARNING: can't generate a core file - core tests suppressed - check ulimit -c
FAIL: gdb.base/msym-bp-shl.exp: debug=0: before run: info breakpoint
FAIL: gdb.base/msym-bp-shl.exp: debug=1: before run: info breakpoint
FAIL: gdb.base/nodebug.exp: p/c (int) array_index("abcdef",2)
FAIL: gdb.base/retval-large-struct.exp: finish from return_large_struct
FAIL: gdb.base/share-env-with-gdbserver.exp: strange named var: print result of getenv for 'asd ='
gdb compile failed, /gdb/testsuite/gdb.base/structs.c: In function 'Fun2':
/gdb/testsuite/gdb.base/structs.c:200:6: note: the ABI of passing aggregates with 16-byte alignment has changed in GCC 5
 void Fun2(struct struct2 foo2)
      ^~~~
FAIL: gdb.base/valgrind-bt.exp: target remote for vgdb
FAIL: gdb.base/valgrind-disp-step.exp: target remote for vgdb
FAIL: gdb.base/valgrind-infcall.exp: target remote for vgdb
FAIL: gdb.base/vla-optimized-out.exp: o1: printed size of optimized out vla
FAIL: gdb.base/watch-before-fork.exp: test: continue to catch fork
DUPLICATE: gdb.base/watchpoint-unaligned.exp: rwatch data.u.size1[2] (PRMS breakpoints/23131)
DUPLICATE: gdb.base/watchpoint-unaligned.exp: rwatch data.u.size1[3] (PRMS breakpoints/23131)
DUPLICATE: gdb.base/watchpoint-unaligned.exp: rwatch data.u.size1[4] (PRMS breakpoints/23131)
FAIL: gdb.cp/gdb2495.exp: call a function that raises an exception without a handler. (timeout)
FAIL: gdb.cp/gdb2495.exp: bt after returning from a popped frame (timeout)
FAIL: gdb.cp/gdb2495.exp: info breakpoints (timeout)
FAIL: gdb.cp/gdb2495.exp: set unwind-on-terminating-exception off (timeout)
FAIL: gdb.cp/gdb2495.exp: turn off unwind on terminating exception flag (timeout)
FAIL: gdb.cp/gdb2495.exp: call a function that raises an exception with unwinding off.. (timeout)
FAIL: gdb.cp/gdb2495.exp: delete all breakpoints in delete_breakpoints (timeout)
ERROR: breakpoints not deleted
UNRESOLVED: gdb.cp/gdb2495.exp: gdb_breakpoint: set breakpoint at main (timeout)
ERROR: couldn't run to main
FAIL: gdb.cp/non-trivial-retval.exp: finish from f1
FAIL: gdb.cp/non-trivial-retval.exp: finish from f2
FAIL: gdb.cp/non-trivial-retval.exp: finish from f22
FAIL: gdb.cp/non-trivial-retval.exp: finish from f3
FAIL: gdb.cp/non-trivial-retval.exp: finish from f4
FAIL: gdb.cp/typeid.exp: before starting: print &typeid(i)
FAIL: gdb.cp/typeid.exp: before starting: print &typeid(i) == &typeid(typeof(i))
FAIL: gdb.cp/typeid.exp: before starting: print &typeid(cp)
FAIL: gdb.cp/typeid.exp: before starting: print &typeid(cp) == &typeid(typeof(cp))
FAIL: gdb.cp/typeid.exp: before starting: print &typeid(ccp)
FAIL: gdb.cp/typeid.exp: before starting: print &typeid(ccp) == &typeid(typeof(ccp))
FAIL: gdb.dwarf2/dw2-unspecified-type.exp: p ((int (*) ()) foo) ()
FAIL: gdb.dwarf2/dw2-unspecified-type.exp: p (int) foo ()
FAIL: gdb.gdb/python-helper.exp: hit breakpoint in outer gdb (timeout)
FAIL: gdb.gdb/python-helper.exp: print integer from DWARF info (timeout)
FAIL: gdb.gdb/python-helper.exp: hit breakpoint in outer gdb again (timeout)
FAIL: gdb.gdb/python-helper.exp: print *type->main_type
FAIL: gdb.go/global-local-var-shadow.exp: string after assignment check
FAIL: gdb.go/hello.exp: string after assignment check
FAIL: gdb.go/max-depth.exp: exp='s1': depth=1: p s1
FAIL: gdb.go/max-depth.exp: exp='s1': depth=2: p s1
FAIL: gdb.go/max-depth.exp: exp='s1': depth=unlimited: p s1
WARNING: can't generate a core file - core tests suppressed - check ulimit -c
ERROR: tcl error sourcing /gdb/testsuite/gdb.multi/attach-no-multi-process.exp.
ERROR: Timeout waiting for gdbserver response.
    while executing
"error "Timeout waiting for gdbserver response.""
    invoked from within
"expect {
	    -i $server_spawn_id
	    -timeout 120
	    -notransfer
	    -re "Listening on" { }
	    -re "Can't (bind address|listen on socket): Addr..."
    (procedure "gdbserver_start" line 120)
    invoked from within
"gdbserver_start "--multi" """
    (procedure "test" line 24)
    invoked from within
"test $target_non_stop"
    ("uplevel" body line 2)
    invoked from within
"uplevel 1 $body"
    invoked from within
"foreach_with_prefix target_non_stop {off on} {
    test $target_non_stop
}"
    (file "/gdb/testsuite/gdb.multi/attach-no-multi-process.exp" line 89)
    invoked from within
"source /gdb/testsuite/gdb.multi/attach-no-multi-process.exp"
    ("uplevel" body line 1)
    invoked from within
"uplevel #0 source /gdb/testsuite/gdb.multi/attach-no-multi-process.exp"
    invoked from within
"catch "uplevel #0 source $test_file_name""
WARNING: Timed out waiting for EOF in server after monitor exit
gdb compile failed, In file included from /gdb/testsuite/gdb.multi/hangout.c:18:0:
/usr/include/stdio.h:27:10: fatal error: bits/libc-header-start.h: No such file or directory
 #include <bits/libc-header-start.h>
          ^~~~~~~~~~~~~~~~~~~~~~~~~~
compilation terminated.
DUPLICATE: gdb.opt/inline-cmds.exp: finish from marker
FAIL: gdb.opt/solib-intra-step.exp: second-hit
ERROR: GDB process no longer exists
UNRESOLVED: gdb.python/py-disasm.exp: global_disassembler=ReadMemoryGdbErrorDisassembler: disassemble test
ERROR: Couldn't send python remove_all_python_disassemblers() to GDB.
ERROR: can not find channel named "exp43"
    while executing
"expect {
-i exp43 -timeout 10 
	-re ".*A problem internal to GDB has been detected" {
	    fail "$message (GDB internal error)"
	    gdb_internal_erro..."
    ("uplevel" body line 1)
    invoked from within
"uplevel $body" TCL LOOKUP CHANNEL exp43 can not find channel named "exp43"
ERROR: Couldn't send python add_global_disassembler(ReadMemoryRuntimeErrorDisassembler) to GDB.
ERROR: can not find channel named "exp43"
    while executing
"expect {
-i exp43 -timeout 10 
	-re ".*A problem internal to GDB has been detected" {
	    fail "$message (GDB internal error)"
	    gdb_internal_erro..."
    ("uplevel" body line 1)
    invoked from within
"uplevel $body" TCL LOOKUP CHANNEL exp43 can not find channel named "exp43"
ERROR: Couldn't send disassemble test to GDB.
ERROR: can not find channel named "exp43"
    while executing
"expect {
-i exp43 -timeout 10 
	-re ".*A problem internal to GDB has been detected" {
	    fail "$message (GDB internal error)"
	    gdb_internal_erro..."
    ("uplevel" body line 1)
    invoked from within
"uplevel $body" TCL LOOKUP CHANNEL exp43 can not find channel named "exp43"
ERROR: Couldn't send python remove_all_python_disassemblers() to GDB.
ERROR: can not find channel named "exp43"
    while executing
"expect {
-i exp43 -timeout 10 
	-re ".*A problem internal to GDB has been detected" {
	    fail "$message (GDB internal error)"
	    gdb_internal_erro..."
    ("uplevel" body line 1)
    invoked from within
"uplevel $body" TCL LOOKUP CHANNEL exp43 can not find channel named "exp43"
ERROR: Couldn't send python add_global_disassembler(ReadMemoryCaughtMemoryErrorDisassembler) to GDB.
ERROR: can not find channel named "exp43"
    while executing
"expect {
-i exp43 -timeout 10 
	-re ".*A problem internal to GDB has been detected" {
	    fail "$message (GDB internal error)"
	    gdb_internal_erro..."
    ("uplevel" body line 1)
    invoked from within
"uplevel $body" TCL LOOKUP CHANNEL exp43 can not find channel named "exp43"
ERROR: Couldn't send disassemble test to GDB.
ERROR: can not find channel named "exp43"
    while executing
"expect {
-i exp43 -timeout 10 
	-re ".*A problem internal to GDB has been detected" {
	    fail "$message (GDB internal error)"
	    gdb_internal_erro..."
    ("uplevel" body line 1)
    invoked from within
"uplevel $body" TCL LOOKUP CHANNEL exp43 can not find channel named "exp43"
ERROR: Couldn't send python remove_all_python_disassemblers() to GDB.
ERROR: can not find channel named "exp43"
    while executing
"expect {
-i exp43 -timeout 10 
	-re ".*A problem internal to GDB has been detected" {
	    fail "$message (GDB internal error)"
	    gdb_internal_erro..."
    ("uplevel" body line 1)
    invoked from within
"uplevel $body" TCL LOOKUP CHANNEL exp43 can not find channel named "exp43"
ERROR: Couldn't send python add_global_disassembler(ReadMemoryCaughtGdbErrorDisassembler) to GDB.
ERROR: can not find channel named "exp43"
    while executing
"expect {
-i exp43 -timeout 10 
	-re ".*A problem internal to GDB has been detected" {
	    fail "$message (GDB internal error)"
	    gdb_internal_erro..."
    ("uplevel" body line 1)
    invoked from within
"uplevel $body" TCL LOOKUP CHANNEL exp43 can not find channel named "exp43"
ERROR: Couldn't send disassemble test to GDB.
ERROR: can not find channel named "exp43"
    while executing
"expect {
-i exp43 -timeout 10 
	-re ".*A problem internal to GDB has been detected" {
	    fail "$message (GDB internal error)"
	    gdb_internal_erro..."
    ("uplevel" body line 1)
    invoked from within
"uplevel $body" TCL LOOKUP CHANNEL exp43 can not find channel named "exp43"
ERROR: Couldn't send python remove_all_python_disassemblers() to GDB.
ERROR: can not find channel named "exp43"
    while executing
"expect {
-i exp43 -timeout 10 
	-re ".*A problem internal to GDB has been detected" {
	    fail "$message (GDB internal error)"
	    gdb_internal_erro..."
    ("uplevel" body line 1)
    invoked from within
"uplevel $body" TCL LOOKUP CHANNEL exp43 can not find channel named "exp43"
ERROR: Couldn't send python add_global_disassembler(ReadMemoryCaughtRuntimeErrorDisassembler) to GDB.
ERROR: can not find channel named "exp43"
    while executing
"expect {
-i exp43 -timeout 10 
	-re ".*A problem internal to GDB has been detected" {
	    fail "$message (GDB internal error)"
	    gdb_internal_erro..."
    ("uplevel" body line 1)
    invoked from within
"uplevel $body" TCL LOOKUP CHANNEL exp43 can not find channel named "exp43"
ERROR: Couldn't send disassemble test to GDB.
ERROR: can not find channel named "exp43"
    while executing
"expect {
-i exp43 -timeout 10 
	-re ".*A problem internal to GDB has been detected" {
	    fail "$message (GDB internal error)"
	    gdb_internal_erro..."
    ("uplevel" body line 1)
    invoked from within
"uplevel $body" TCL LOOKUP CHANNEL exp43 can not find channel named "exp43"
ERROR: Couldn't send python remove_all_python_disassemblers() to GDB.
ERROR: can not find channel named "exp43"
    while executing
"expect {
-i exp43 -timeout 10 
	-re ".*A problem internal to GDB has been detected" {
	    fail "$message (GDB internal error)"
	    gdb_internal_erro..."
    ("uplevel" body line 1)
    invoked from within
"uplevel $body" TCL LOOKUP CHANNEL exp43 can not find channel named "exp43"
ERROR: Couldn't send python add_global_disassembler(MemorySourceNotABufferDisassembler) to GDB.
ERROR: can not find channel named "exp43"
    while executing
"expect {
-i exp43 -timeout 10 
	-re ".*A problem internal to GDB has been detected" {
	    fail "$message (GDB internal error)"
	    gdb_internal_erro..."
    ("uplevel" body line 1)
    invoked from within
"uplevel $body" TCL LOOKUP CHANNEL exp43 can not find channel named "exp43"
ERROR: Couldn't send disassemble test to GDB.
ERROR: can not find channel named "exp43"
    while executing
"expect {
-i exp43 -timeout 10 
	-re ".*A problem internal to GDB has been detected" {
	    fail "$message (GDB internal error)"
	    gdb_internal_erro..."
    ("uplevel" body line 1)
    invoked from within
"uplevel $body" TCL LOOKUP CHANNEL exp43 can not find channel named "exp43"
ERROR: Couldn't send python remove_all_python_disassemblers() to GDB.
ERROR: can not find channel named "exp43"
    while executing
"expect {
-i exp43 -timeout 10 
	-re ".*A problem internal to GDB has been detected" {
	    fail "$message (GDB internal error)"
	    gdb_internal_erro..."
    ("uplevel" body line 1)
    invoked from within
"uplevel $body" TCL LOOKUP CHANNEL exp43 can not find channel named "exp43"
ERROR: Couldn't send python add_global_disassembler(MemorySourceBufferTooLongDisassembler) to GDB.
ERROR: can not find channel named "exp43"
    while executing
"expect {
-i exp43 -timeout 10 
	-re ".*A problem internal to GDB has been detected" {
	    fail "$message (GDB internal error)"
	    gdb_internal_erro..."
    ("uplevel" body line 1)
    invoked from within
"uplevel $body" TCL LOOKUP CHANNEL exp43 can not find channel named "exp43"
ERROR: Couldn't send disassemble test to GDB.
ERROR: can not find channel named "exp43"
    while executing
"expect {
-i exp43 -timeout 10 
	-re ".*A problem internal to GDB has been detected" {
	    fail "$message (GDB internal error)"
	    gdb_internal_erro..."
    ("uplevel" body line 1)
    invoked from within
"uplevel $body" TCL LOOKUP CHANNEL exp43 can not find channel named "exp43"
ERROR: Couldn't send python remove_all_python_disassemblers() to GDB.
ERROR: can not find channel named "exp43"
    while executing
"expect {
-i exp43 -timeout 10 
	-re ".*A problem internal to GDB has been detected" {
	    fail "$message (GDB internal error)"
	    gdb_internal_erro..."
    ("uplevel" body line 1)
    invoked from within
"uplevel $body" TCL LOOKUP CHANNEL exp43 can not find channel named "exp43"
ERROR: Couldn't send python add_global_disassembler(ResultOfWrongType) to GDB.
ERROR: can not find channel named "exp43"
    while executing
"expect {
-i exp43 -timeout 10 
	-re ".*A problem internal to GDB has been detected" {
	    fail "$message (GDB internal error)"
	    gdb_internal_erro..."
    ("uplevel" body line 1)
    invoked from within
"uplevel $body" TCL LOOKUP CHANNEL exp43 can not find channel named "exp43"
ERROR: Couldn't send disassemble test to GDB.
ERROR: can not find channel named "exp43"
    while executing
"expect {
-i exp43 -timeout 10 
	-re ".*A problem internal to GDB has been detected" {
	    fail "$message (GDB internal error)"
	    gdb_internal_erro..."
    ("uplevel" body line 1)
    invoked from within
"uplevel $body" TCL LOOKUP CHANNEL exp43 can not find channel named "exp43"
ERROR: Couldn't send python remove_all_python_disassemblers() to GDB.
ERROR: can not find channel named "exp43"
    while executing
"expect {
-i exp43 -timeout 10 
	-re ".*A problem internal to GDB has been detected" {
	    fail "$message (GDB internal error)"
	    gdb_internal_erro..."
    ("uplevel" body line 1)
    invoked from within
"uplevel $body" TCL LOOKUP CHANNEL exp43 can not find channel named "exp43"
ERROR: Couldn't send python add_global_disassembler(ResultWithInvalidLength) to GDB.
ERROR: can not find channel named "exp43"
    while executing
"expect {
-i exp43 -timeout 10 
	-re ".*A problem internal to GDB has been detected" {
	    fail "$message (GDB internal error)"
	    gdb_internal_erro..."
    ("uplevel" body line 1)
    invoked from within
"uplevel $body" TCL LOOKUP CHANNEL exp43 can not find channel named "exp43"
ERROR: Couldn't send disassemble test to GDB.
ERROR: can not find channel named "exp43"
    while executing
"expect {
-i exp43 -timeout 10 
	-re ".*A problem internal to GDB has been detected" {
	    fail "$message (GDB internal error)"
	    gdb_internal_erro..."
    ("uplevel" body line 1)
    invoked from within
"uplevel $body" TCL LOOKUP CHANNEL exp43 can not find channel named "exp43"
ERROR: Couldn't send python remove_all_python_disassemblers() to GDB.
ERROR: can not find channel named "exp43"
    while executing
"expect {
-i exp43 -timeout 10 
	-re ".*A problem internal to GDB has been detected" {
	    fail "$message (GDB internal error)"
	    gdb_internal_erro..."
    ("uplevel" body line 1)
    invoked from within
"uplevel $body" TCL LOOKUP CHANNEL exp43 can not find channel named "exp43"
ERROR: Couldn't send python add_global_disassembler(ResultWithInvalidString) to GDB.
ERROR: can not find channel named "exp43"
    while executing
"expect {
-i exp43 -timeout 10 
	-re ".*A problem internal to GDB has been detected" {
	    fail "$message (GDB internal error)"
	    gdb_internal_erro..."
    ("uplevel" body line 1)
    invoked from within
"uplevel $body" TCL LOOKUP CHANNEL exp43 can not find channel named "exp43"
ERROR: Couldn't send disassemble test to GDB.
ERROR: can not find channel named "exp43"
    while executing
"expect {
-i exp43 -timeout 10 
	-re ".*A problem internal to GDB has been detected" {
	    fail "$message (GDB internal error)"
	    gdb_internal_erro..."
    ("uplevel" body line 1)
    invoked from within
"uplevel $body" TCL LOOKUP CHANNEL exp43 can not find channel named "exp43"
ERROR: Couldn't send python gdb.disassembler.DisassemblerResult(0, 'abc') to GDB.
ERROR: can not find channel named "exp43"
    while executing
"expect {
-i exp43 -timeout 10 
	-re ".*A problem internal to GDB has been detected" {
	    fail "$message (GDB internal error)"
	    gdb_internal_erro..."
    ("uplevel" body line 1)
    invoked from within
"uplevel $body" TCL LOOKUP CHANNEL exp43 can not find channel named "exp43"
ERROR: Couldn't send python gdb.disassembler.DisassemblerResult(-1, 'abc') to GDB.
ERROR: can not find channel named "exp43"
    while executing
"expect {
-i exp43 -timeout 10 
	-re ".*A problem internal to GDB has been detected" {
	    fail "$message (GDB internal error)"
	    gdb_internal_erro..."
    ("uplevel" body line 1)
    invoked from within
"uplevel $body" TCL LOOKUP CHANNEL exp43 can not find channel named "exp43"
ERROR: Couldn't send python gdb.disassembler.DisassemblerResult(1, '') to GDB.
ERROR: can not find channel named "exp43"
    while executing
"expect {
-i exp43 -timeout 10 
	-re ".*A problem internal to GDB has been detected" {
	    fail "$message (GDB internal error)"
	    gdb_internal_erro..."
    ("uplevel" body line 1)
    invoked from within
"uplevel $body" TCL LOOKUP CHANNEL exp43 can not find channel named "exp43"
ERROR: Couldn't send python remove_all_python_disassemblers() to GDB.
ERROR: can not find channel named "exp43"
    while executing
"expect {
-i exp43 -timeout 10 
	-re ".*A problem internal to GDB has been detected" {
	    fail "$message (GDB internal error)"
	    gdb_internal_erro..."
    ("uplevel" body line 1)
    invoked from within
"uplevel $body" TCL LOOKUP CHANNEL exp43 can not find channel named "exp43"
ERROR: Couldn't send python gdb.disassembler.register_disassembler(TaggingDisassembler("GLOBAL"), None) to GDB.
ERROR: can not find channel named "exp43"
    while executing
"expect {
-i exp43 -timeout 10 
	-re ".*A problem internal to GDB has been detected" {
	    fail "$message (GDB internal error)"
	    gdb_internal_erro..."
    ("uplevel" body line 1)
    invoked from within
"uplevel $body" TCL LOOKUP CHANNEL exp43 can not find channel named "exp43"
ERROR: Couldn't send disassemble test to GDB.
ERROR: can not find channel named "exp43"
    while executing
"expect {
-i exp43 -timeout 10 
	-re ".*A problem internal to GDB has been detected" {
	    fail "$message (GDB internal error)"
	    gdb_internal_erro..."
    ("uplevel" body line 1)
    invoked from within
"uplevel $body" TCL LOOKUP CHANNEL exp43 can not find channel named "exp43"
ERROR: Couldn't send python gdb.disassembler.register_disassembler(TaggingDisassembler("LOCAL"), "powerpc:common64") to GDB.
ERROR: can not find channel named "exp43"
    while executing
"expect {
-i exp43 -timeout 10 
	-re ".*A problem internal to GDB has been detected" {
	    fail "$message (GDB internal error)"
	    gdb_internal_erro..."
    ("uplevel" body line 1)
    invoked from within
"uplevel $body" TCL LOOKUP CHANNEL exp43 can not find channel named "exp43"
ERROR: Couldn't send disassemble test to GDB.
ERROR: can not find channel named "exp43"
    while executing
"expect {
-i exp43 -timeout 10 
	-re ".*A problem internal to GDB has been detected" {
	    fail "$message (GDB internal error)"
	    gdb_internal_erro..."
    ("uplevel" body line 1)
    invoked from within
"uplevel $body" TCL LOOKUP CHANNEL exp43 can not find channel named "exp43"
ERROR: Couldn't send python gdb.disassembler.register_disassembler(None, "powerpc:common64") to GDB.
ERROR: can not find channel named "exp43"
    while executing
"expect {
-i exp43 -timeout 10 
	-re ".*A problem internal to GDB has been detected" {
	    fail "$message (GDB internal error)"
	    gdb_internal_erro..."
    ("uplevel" body line 1)
    invoked from within
"uplevel $body" TCL LOOKUP CHANNEL exp43 can not find channel named "exp43"
ERROR: Couldn't send disassemble test to GDB.
ERROR: can not find channel named "exp43"
    while executing
"expect {
-i exp43 -timeout 10 
	-re ".*A problem internal to GDB has been detected" {
	    fail "$message (GDB internal error)"
	    gdb_internal_erro..."
    ("uplevel" body line 1)
    invoked from within
"uplevel $body" TCL LOOKUP CHANNEL exp43 can not find channel named "exp43"
ERROR: Couldn't send python remove_all_python_disassemblers() to GDB.
ERROR: can not find channel named "exp43"
    while executing
"expect {
-i exp43 -timeout 10 
	-re ".*A problem internal to GDB has been detected" {
	    fail "$message (GDB internal error)"
	    gdb_internal_erro..."
    ("uplevel" body line 1)
    invoked from within
"uplevel $body" TCL LOOKUP CHANNEL exp43 can not find channel named "exp43"
ERROR: Couldn't send python add_global_disassembler(GlobalCachingDisassembler) to GDB.
ERROR: can not find channel named "exp43"
    while executing
"expect {
-i exp43 -timeout 10 
	-re ".*A problem internal to GDB has been detected" {
	    fail "$message (GDB internal error)"
	    gdb_internal_erro..."
    ("uplevel" body line 1)
    invoked from within
"uplevel $body" TCL LOOKUP CHANNEL exp43 can not find channel named "exp43"
ERROR: Couldn't send disassemble test to GDB.
ERROR: can not find channel named "exp43"
    while executing
"expect {
-i exp43 -timeout 10 
	-re ".*A problem internal to GDB has been detected" {
	    fail "$message (GDB internal error)"
	    gdb_internal_erro..."
    ("uplevel" body line 1)
    invoked from within
"uplevel $body" TCL LOOKUP CHANNEL exp43 can not find channel named "exp43"
ERROR: Couldn't send python GlobalCachingDisassembler.check() to GDB.
ERROR: can not find channel named "exp43"
    while executing
"expect {
-i exp43 -timeout 10 
	-re ".*A problem internal to GDB has been detected" {
	    fail "$message (GDB internal error)"
	    gdb_internal_erro..."
    ("uplevel" body line 1)
    invoked from within
"uplevel $body" TCL LOOKUP CHANNEL exp43 can not find channel named "exp43"
ERROR: Couldn't send python remove_all_python_disassemblers() to GDB.
ERROR: can not find channel named "exp43"
    while executing
"expect {
-i exp43 -timeout 10 
	-re ".*A problem internal to GDB has been detected" {
	    fail "$message (GDB internal error)"
	    gdb_internal_erro..."
    ("uplevel" body line 1)
    invoked from within
"uplevel $body" TCL LOOKUP CHANNEL exp43 can not find channel named "exp43"
ERROR: Couldn't send python analyzing_disassembler = add_global_disassembler(AnalyzingDisassembler) to GDB.
ERROR: can not find channel named "exp43"
    while executing
"expect {
-i exp43 -timeout 10 
	-re ".*A problem internal to GDB has been detected" {
	    fail "$message (GDB internal error)"
	    gdb_internal_erro..."
    ("uplevel" body line 1)
    invoked from within
"uplevel $body" TCL LOOKUP CHANNEL exp43 can not find channel named "exp43"
ERROR: Couldn't send disassemble test to GDB.
ERROR: can not find channel named "exp43"
    while executing
"expect {
-i exp43 -timeout 10 
	-re ".*A problem internal to GDB has been detected" {
	    fail "$message (GDB internal error)"
	    gdb_internal_erro..."
    ("uplevel" body line 1)
    invoked from within
"uplevel $body" TCL LOOKUP CHANNEL exp43 can not find channel named "exp43"
ERROR: Couldn't send python analyzing_disassembler.find_replacement_candidate() to GDB.
ERROR: can not find channel named "exp43"
    while executing
"expect {
-i exp43 -timeout 10 
	-re ".*A problem internal to GDB has been detected" {
	    fail "$message (GDB internal error)"
	    gdb_internal_erro..."
    ("uplevel" body line 1)
    invoked from within
"uplevel $body" TCL LOOKUP CHANNEL exp43 can not find channel named "exp43"
ERROR: Couldn't send disassemble test to GDB.
ERROR: can not find channel named "exp43"
    while executing
"expect {
-i exp43 -timeout 10 
	-re ".*A problem internal to GDB has been detected" {
	    fail "$message (GDB internal error)"
	    gdb_internal_erro..."
    ("uplevel" body line 1)
    invoked from within
"uplevel $body" TCL LOOKUP CHANNEL exp43 can not find channel named "exp43"
ERROR: Couldn't send python analyzing_disassembler.check() to GDB.
ERROR: can not find channel named "exp43"
    while executing
"expect {
-i exp43 -timeout 10 
	-re ".*A problem internal to GDB has been detected" {
	    fail "$message (GDB internal error)"
	    gdb_internal_erro..."
    ("uplevel" body line 1)
    invoked from within
"uplevel $body" TCL LOOKUP CHANNEL exp43 can not find channel named "exp43"
ERROR: Couldn't send python remove_all_python_disassemblers() to GDB.
ERROR: can not find channel named "exp43"
    while executing
"expect {
-i exp43 -timeout 10 
	-re ".*A problem internal to GDB has been detected" {
	    fail "$message (GDB internal error)"
	    gdb_internal_erro..."
    ("uplevel" body line 1)
    invoked from within
"uplevel $body" TCL LOOKUP CHANNEL exp43 can not find channel named "exp43"
ERROR: Couldn't send maint info python-disassemblers to GDB.
ERROR: can not find channel named "exp43"
    while executing
"expect {
-i exp43 -timeout 10 
	-re ".*A problem internal to GDB has been detected" {
	    fail "$message (GDB internal error)"
	    gdb_internal_erro..."
    ("uplevel" body line 1)
    invoked from within
"uplevel $body" TCL LOOKUP CHANNEL exp43 can not find channel named "exp43"
ERROR: Couldn't send python disasm = add_global_disassembler(BuiltinDisassembler) to GDB.
ERROR: can not find channel named "exp43"
    while executing
"expect {
-i exp43 -timeout 10 
	-re ".*A problem internal to GDB has been detected" {
	    fail "$message (GDB internal error)"
	    gdb_internal_erro..."
    ("uplevel" body line 1)
    invoked from within
"uplevel $body" TCL LOOKUP CHANNEL exp43 can not find channel named "exp43"
ERROR: Couldn't send maint info python-disassemblers to GDB.
ERROR: can not find channel named "exp43"
    while executing
"expect {
-i exp43 -timeout 10 
	-re ".*A problem internal to GDB has been detected" {
	    fail "$message (GDB internal error)"
	    gdb_internal_erro..."
    ("uplevel" body line 1)
    invoked from within
"uplevel $body" TCL LOOKUP CHANNEL exp43 can not find channel named "exp43"
ERROR: Couldn't send python arch = gdb.selected_inferior().architecture().name() to GDB.
ERROR: can not find channel named "exp43"
    while executing
"expect {
-i exp43 -timeout 10 
	-re ".*A problem internal to GDB has been detected" {
	    fail "$message (GDB internal error)"
	    gdb_internal_erro..."
    ("uplevel" body line 1)
    invoked from within
"uplevel $body" TCL LOOKUP CHANNEL exp43 can not find channel named "exp43"
ERROR: Couldn't send python gdb.disassembler.register_disassembler(disasm, arch) to GDB.
ERROR: can not find channel named "exp43"
    while executing
"expect {
-i exp43 -timeout 10 
	-re ".*A problem internal to GDB has been detected" {
	    fail "$message (GDB internal error)"
	    gdb_internal_erro..."
    ("uplevel" body line 1)
    invoked from within
"uplevel $body" TCL LOOKUP CHANNEL exp43 can not find channel named "exp43"
ERROR: Couldn't send maint info python-disassemblers to GDB.
ERROR: can not find channel named "exp43"
    while executing
"expect {
-i exp43 -timeout 10 
	-re ".*A problem internal to GDB has been detected" {
	    fail "$message (GDB internal error)"
	    gdb_internal_erro..."
    ("uplevel" body line 1)
    invoked from within
"uplevel $body" TCL LOOKUP CHANNEL exp43 can not find channel named "exp43"
ERROR: Couldn't send disassemble main to GDB.
ERROR: can not find channel named "exp43"
    while executing
"expect {
-i exp43 -timeout 10 
	-re ".*A problem internal to GDB has been detected" {
	    fail "$message (GDB internal error)"
	    gdb_internal_erro..."
    ("uplevel" body line 1)
    invoked from within
"uplevel $body" TCL LOOKUP CHANNEL exp43 can not find channel named "exp43"
ERROR: Couldn't send python my_info = InvalidDisassembleInfo() to GDB.
ERROR: can not find channel named "exp43"
    while executing
"expect {
-i exp43 -timeout 10 
	-re ".*A problem internal to GDB has been detected" {
	    fail "$message (GDB internal error)"
	    gdb_internal_erro..."
    ("uplevel" body line 1)
    invoked from within
"uplevel $body" TCL LOOKUP CHANNEL exp43 can not find channel named "exp43"
ERROR: Couldn't send python print(my_info.is_valid()) to GDB.
ERROR: can not find channel named "exp43"
    while executing
"expect {
-i exp43 -timeout 10 
	-re ".*A problem internal to GDB has been detected" {
	    fail "$message (GDB internal error)"
	    gdb_internal_erro..."
    ("uplevel" body line 1)
    invoked from within
"uplevel $body" TCL LOOKUP CHANNEL exp43 can not find channel named "exp43"
ERROR: Couldn't send python gdb.disassembler.builtin_disassemble(my_info) to GDB.
ERROR: can not find channel named "exp43"
    while executing
"expect {
-i exp43 -timeout 10 
	-re ".*A problem internal to GDB has been detected" {
	    fail "$message (GDB internal error)"
	    gdb_internal_erro..."
    ("uplevel" body line 1)
    invoked from within
"uplevel $body" TCL LOOKUP CHANNEL exp43 can not find channel named "exp43"
FAIL: gdb.reverse/finish-precsave.exp: reverse finish from long_long_func
FAIL: gdb.reverse/finish-precsave.exp: continue to breakpoint: long_func backward
FAIL: gdb.reverse/finish-precsave.exp: reverse finish from long_func
FAIL: gdb.reverse/finish-precsave.exp: continue to breakpoint: int_func backward
FAIL: gdb.reverse/finish-precsave.exp: reverse finish from int_func
FAIL: gdb.reverse/finish-precsave.exp: continue to breakpoint: short_func backward
FAIL: gdb.reverse/finish-precsave.exp: reverse finish from short_func
FAIL: gdb.reverse/finish-precsave.exp: continue to breakpoint: char_func backward
FAIL: gdb.reverse/finish-precsave.exp: reverse finish from char_func
FAIL: gdb.reverse/finish-precsave.exp: continue to breakpoint: void_func backward
FAIL: gdb.reverse/finish-precsave.exp: reverse finish from void_func
FAIL: gdb.reverse/finish-reverse-bkpt.exp: reverse-finish from void_func trips breakpoint at entry
FAIL: gdb.reverse/finish-reverse-bkpt.exp: no spurious proceed after breakpoint stop
FAIL: gdb.reverse/finish-reverse.exp: reverse finish from long_long_func
FAIL: gdb.reverse/finish-reverse.exp: continue to breakpoint: long_func backward
FAIL: gdb.reverse/finish-reverse.exp: reverse finish from long_func
FAIL: gdb.reverse/finish-reverse.exp: continue to breakpoint: int_func backward
FAIL: gdb.reverse/finish-reverse.exp: reverse finish from int_func
FAIL: gdb.reverse/finish-reverse.exp: continue to breakpoint: short_func backward
FAIL: gdb.reverse/finish-reverse.exp: reverse finish from short_func
FAIL: gdb.reverse/finish-reverse.exp: continue to breakpoint: char_func backward
FAIL: gdb.reverse/finish-reverse.exp: reverse finish from char_func
FAIL: gdb.reverse/finish-reverse.exp: continue to breakpoint: void_func backward
FAIL: gdb.reverse/finish-reverse.exp: reverse finish from void_func
FAIL: gdb.reverse/next-reverse-bkpt-over-sr.exp: reverse-next over call trips user breakpoint at function entry
FAIL: gdb.reverse/next-reverse-bkpt-over-sr.exp: stopped at the right callee call
gdb compile failed, gcc: error: unrecognized command line option '-mindirect-branch=thunk'; did you mean '-findirect-inlining'?
gcc: error: unrecognized command line option '-mfunction-return=thunk'; did you mean '-Wfunction-elimination'?
FAIL: gdb.rust/unicode.exp: print D
FAIL: gdb.rust/unicode.exp: print D in string
FAIL: gdb.rust/unicode.exp: print D as char
ERROR: GDB process no longer exists
UNRESOLVED: gdb.threads/attach-many-short-lived-threads.exp: iter 1: attach
WARNING: can't generate a core file - core tests suppressed - check ulimit -c
ERROR: GDB process no longer exists
UNRESOLVED: gdb.threads/process-dies-while-detaching.exp: single-process: continue: watchpoint:sw: continue (PRMS gdb/28375)
WARNING: can't generate a core file - core tests suppressed - check ulimit -c

		=== gdb Summary ===

# of unexpected core files	1
# of expected passes		103262
# of unexpected failures	72
# of expected failures		284
# of known failures		77
# of unresolved testcases	4
# of untested testcases		57
# of unsupported tests		371
# of duplicate test names	5
/gdb/gdb version  13.0.50.20220913-git -nw -nx -iex "set height 0" -iex "set width 0" -data-directory /gdb/testsuite/../data-directory 

PATH=/usr/bin:/bin

GCC Version

Using built-in specs.
COLLECT_GCC=gcc
COLLECT_LTO_WRAPPER=/usr/lib/gcc/powerpc64le-linux-gnu/7/lto-wrapper
Target: powerpc64le-linux-gnu
Configured with: ../src/configure -v --with-pkgversion='Ubuntu 7.5.0-3ubuntu1~18.04' --with-bugurl=file:///usr/share/doc/gcc-7/README.Bugs --enable-languages=c,ada,c++,go,d,fortran,objc,obj-c++ --prefix=/usr --with-gcc-major-version-only --program-suffix=-7 --program-prefix=powerpc64le-linux-gnu- --enable-shared --enable-linker-build-id --libexecdir=/usr/lib --without-included-gettext --enable-threads=posix --libdir=/usr/lib --enable-nls --enable-bootstrap --enable-clocale=gnu --enable-libstdcxx-debug --enable-libstdcxx-time=yes --with-default-libstdcxx-abi=new --enable-gnu-unique-object --disable-libquadmath --disable-libquadmath-support --enable-plugin --enable-default-pie --with-system-zlib --enable-objc-gc=auto --enable-secureplt --with-cpu=power8 --enable-targets=powerpcle-linux --disable-multilib --enable-multiarch --disable-werror --with-long-double-128 --enable-checking=release --build=powerpc64le-linux-gnu --host=powerpc64le-linux-gnu --target=powerpc64le-linux-gnu
Thread model: posix
gcc version 7.5.0 (Ubuntu 7.5.0-3ubuntu1~18.04) 

^ permalink raw reply	[flat|nested] 2+ messages in thread

end of thread, other threads:[~2022-09-13  8:42 UTC | newest]

Thread overview: 2+ messages (download: mbox.gz / follow: Atom feed)
-- links below jump to the message on this page --
2022-09-13  7:30 GNU gdb (GDB) 13.0.50.20220913-git ppc64le-ibm-linux-gnu GIT commit: 77c2f1aad10656edc774eb962937b778e78d1a37 Will Schmidt [POWER10]
2022-09-13  8:42 Will Schmidt [POWER8E]

This is a public inbox, see mirroring instructions
for how to clone and mirror all data and code used for this inbox;
as well as URLs for read-only IMAP folder(s) and NNTP newsgroup(s).