public inbox for elfutils@sourceware.org
 help / color / mirror / Atom feed
* ☠ Buildbot (GNU Toolchain): elfutils - failed test (failure) (master)
@ 2022-07-31 23:54 builder
  2022-08-01  0:09 ` Mark Wielaard
  0 siblings, 1 reply; 41+ messages in thread
From: builder @ 2022-07-31 23:54 UTC (permalink / raw)
  To: elfutils-devel

A new failure has been detected on builder elfutils-fedora-s390x while building elfutils.

Full details are available at:
    https://builder.sourceware.org/buildbot/#builders/43/builds/47

Build state: failed test (failure)
Revision: 369c021c6eedae3665c1dbbaa4fc43afbbb698f4
Worker: fedora-s390x
Build Reason: (unknown)
Blamelist: Di Chen <dichen@redhat.com>

Steps:

- 0: worker_preparation ( success )

- 1: set package name ( success )

- 2: git checkout ( success )
    Logs:
        - stdio: https://builder.sourceware.org/buildbot/#builders/43/builds/47/steps/2/logs/stdio

- 3: autoreconf ( success )
    Logs:
        - stdio: https://builder.sourceware.org/buildbot/#builders/43/builds/47/steps/3/logs/stdio

- 4: configure ( success )
    Logs:
        - stdio: https://builder.sourceware.org/buildbot/#builders/43/builds/47/steps/4/logs/stdio

- 5: get version ( success )
    Logs:
        - stdio: https://builder.sourceware.org/buildbot/#builders/43/builds/47/steps/5/logs/stdio
        - property changes: https://builder.sourceware.org/buildbot/#builders/43/builds/47/steps/5/logs/property_changes

- 6: make ( warnings )
    Logs:
        - stdio: https://builder.sourceware.org/buildbot/#builders/43/builds/47/steps/6/logs/stdio
        - warnings (3): https://builder.sourceware.org/buildbot/#builders/43/builds/47/steps/6/logs/warnings__3_

- 7: make check ( failure )
    Logs:
        - stdio: https://builder.sourceware.org/buildbot/#builders/43/builds/47/steps/7/logs/stdio
        - test-suite.log: https://builder.sourceware.org/buildbot/#builders/43/builds/47/steps/7/logs/test-suite_log

- 8: prep ( success )
    Logs:
        - stdio: https://builder.sourceware.org/buildbot/#builders/43/builds/47/steps/8/logs/stdio

- 9: build bunsen.cpio.gz ( success )
    Logs:
        - stdio: https://builder.sourceware.org/buildbot/#builders/43/builds/47/steps/9/logs/stdio

- 10: fetch bunsen.cpio.gz ( success )
    Logs:
        - stdio: https://builder.sourceware.org/buildbot/#builders/43/builds/47/steps/10/logs/stdio

- 11: unpack bunsen.cpio.gz ( success )
    Logs:
        - stdio: https://builder.sourceware.org/buildbot/#builders/43/builds/47/steps/11/logs/stdio

- 12: pass .bunsen.source.gitname ( success )
    Logs:
        - stdio: https://builder.sourceware.org/buildbot/#builders/43/builds/47/steps/12/logs/stdio

- 13: pass .bunsen.source.gitbranch ( success )
    Logs:
        - stdio: https://builder.sourceware.org/buildbot/#builders/43/builds/47/steps/13/logs/stdio

- 14: pass .bunsen.source.gitrepo ( success )
    Logs:
        - stdio: https://builder.sourceware.org/buildbot/#builders/43/builds/47/steps/14/logs/stdio

- 15: upload to bunsen ( success )
    Logs:
        - stdio: https://builder.sourceware.org/buildbot/#builders/43/builds/47/steps/15/logs/stdio

- 16: clean up ( success )
    Logs:
        - stdio: https://builder.sourceware.org/buildbot/#builders/43/builds/47/steps/16/logs/stdio

- 17: make clean ( success )
    Logs:
        - stdio: https://builder.sourceware.org/buildbot/#builders/43/builds/47/steps/17/logs/stdio


^ permalink raw reply	[flat|nested] 41+ messages in thread

* Re: ☠ Buildbot (GNU Toolchain): elfutils - failed test (failure) (master)
  2022-07-31 23:54 ☠ Buildbot (GNU Toolchain): elfutils - failed test (failure) (master) builder
@ 2022-08-01  0:09 ` Mark Wielaard
  2022-08-01  9:13   ` Mark Wielaard
  0 siblings, 1 reply; 41+ messages in thread
From: Mark Wielaard @ 2022-08-01  0:09 UTC (permalink / raw)
  To: Di Chen; +Cc: elfutils-devel

On Sun, Jul 31, 2022 at 11:54:33PM +0000, builder--- via Elfutils-devel wrote:
> A new failure has been detected on builder elfutils-fedora-s390x while building elfutils.
> 
> Full details are available at:
>     https://builder.sourceware.org/buildbot/#builders/43/builds/47
> 
> Build state: failed test (failure)
> Revision: 369c021c6eedae3665c1dbbaa4fc43afbbb698f4
> Worker: fedora-s390x
> Build Reason: (unknown)
> Blamelist: Di Chen <dichen@redhat.com>
> [...]
> - 7: make check ( failure )
>     Logs:
>         - stdio: https://builder.sourceware.org/buildbot/#builders/43/builds/47/steps/7/logs/stdio
>         - test-suite.log: https://builder.sourceware.org/buildbot/#builders/43/builds/47/steps/7/logs/test-suite_log

So that is in the one little addition I made:

-==3856043== Invalid read of size 1
-==3856043==    at 0x484EBE8: memrchr (vg_replace_strmem.c:1012)
-==3856043==    by 0x100FEDF: handle_dynamic (readelf.c:1909)
-==3856043==    by 0x102061D: print_dynamic (readelf.c:2013)
-==3856043==    by 0x102061D: process_elf_file (readelf.c:1034)
-==3856043==    by 0x1021FDB: process_dwflmod (readelf.c:818)
-==3856043==    by 0x4962BCF: dwfl_getmodules (dwfl_getmodules.c:86)
-==3856043==    by 0x100E175: process_file (readelf.c:926)
-==3856043==    by 0x1006A75: main (readelf.c:395)
-==3856043==  Address 0x56df358 is 24 bytes before a block of size 264 alloc'd
-==3856043==    at 0x484C002: calloc (vg_replace_malloc.c:1328)
-==3856043==    by 0x4A4EED9: elf_getdata_rawchunk (elf_getdata_rawchunk.c:173)
-==3856043==    by 0x1010621: get_dynscn_strtab (readelf.c:4958)
-==3856043==    by 0x1010621: handle_dynamic (readelf.c:1884)
-==3856043==    by 0x102061D: print_dynamic (readelf.c:2013)
-==3856043==    by 0x102061D: process_elf_file (readelf.c:1034)
-==3856043==    by 0x1021FDB: process_dwflmod (readelf.c:818)
-==3856043==    by 0x4962BCF: dwfl_getmodules (dwfl_getmodules.c:86)
-==3856043==    by 0x100E175: process_file (readelf.c:926)
-==3856043==    by 0x1006A75: main (readelf.c:395)

I am staring at the code, but don't immediately see which mistake I
made.  Maybe I should use d_val instead of d_ptr (but those are both
uint64_t so that shouldn't really matter).

Cheers,

Mark

^ permalink raw reply	[flat|nested] 41+ messages in thread

* Re: ☠ Buildbot (GNU Toolchain): elfutils - failed test (failure) (master)
  2022-08-01  0:09 ` Mark Wielaard
@ 2022-08-01  9:13   ` Mark Wielaard
  0 siblings, 0 replies; 41+ messages in thread
From: Mark Wielaard @ 2022-08-01  9:13 UTC (permalink / raw)
  To: Di Chen; +Cc: elfutils-devel

[-- Attachment #1: Type: text/plain, Size: 2139 bytes --]

Hi,

On Mon, Aug 01, 2022 at 02:09:52AM +0200, Mark Wielaard wrote:
> > - 7: make check ( failure )
> >     Logs:
> >         - stdio: https://builder.sourceware.org/buildbot/#builders/43/builds/47/steps/7/logs/stdio
> >         - test-suite.log: https://builder.sourceware.org/buildbot/#builders/43/builds/47/steps/7/logs/test-suite_log
> 
> So that is in the one little addition I made:
> 
> -==3856043== Invalid read of size 1
> -==3856043==    at 0x484EBE8: memrchr (vg_replace_strmem.c:1012)
> -==3856043==    by 0x100FEDF: handle_dynamic (readelf.c:1909)
> -==3856043==    by 0x102061D: print_dynamic (readelf.c:2013)
> -==3856043==    by 0x102061D: process_elf_file (readelf.c:1034)
> -==3856043==    by 0x1021FDB: process_dwflmod (readelf.c:818)
> -==3856043==    by 0x4962BCF: dwfl_getmodules (dwfl_getmodules.c:86)
> -==3856043==    by 0x100E175: process_file (readelf.c:926)
> -==3856043==    by 0x1006A75: main (readelf.c:395)
> -==3856043==  Address 0x56df358 is 24 bytes before a block of size 264 alloc'd
> -==3856043==    at 0x484C002: calloc (vg_replace_malloc.c:1328)
> -==3856043==    by 0x4A4EED9: elf_getdata_rawchunk (elf_getdata_rawchunk.c:173)
> -==3856043==    by 0x1010621: get_dynscn_strtab (readelf.c:4958)
> -==3856043==    by 0x1010621: handle_dynamic (readelf.c:1884)
> -==3856043==    by 0x102061D: print_dynamic (readelf.c:2013)
> -==3856043==    by 0x102061D: process_elf_file (readelf.c:1034)
> -==3856043==    by 0x1021FDB: process_dwflmod (readelf.c:818)
> -==3856043==    by 0x4962BCF: dwfl_getmodules (dwfl_getmodules.c:86)
> -==3856043==    by 0x100E175: process_file (readelf.c:926)
> -==3856043==    by 0x1006A75: main (readelf.c:395)
> 
> I am staring at the code, but don't immediately see which mistake I
> made.  Maybe I should use d_val instead of d_ptr (but those are both
> uint64_t so that shouldn't really matter).

Doh. Even though memchr searches backwards, it takes the start of the
buffer instead of the end of the buffer as argument. Fixed as
attached, also cleaned up the use of d_val vs d_ptr. Pushed after
verifying with a try- build that it really fixes the issue.

Cheers,

Mark

[-- Attachment #2: 0001-readelf-memrchr-searches-backwards-but-takes-the-sta.patch --]
[-- Type: text/x-diff, Size: 1708 bytes --]

From d0ff4e224738adf34eba38dc33ffda67e5da6634 Mon Sep 17 00:00:00 2001
From: Mark Wielaard <mark@klomp.org>
Date: Mon, 1 Aug 2022 02:02:16 +0200
Subject: [PATCH] readelf: memrchr searches backwards but takes the start buf
 as argument

The bug (caught by valgrind) was giving memrchr to end of the buffer.

Also as cleanup, Use d_val not d_ptr for calculating offset.
---
 src/ChangeLog | 5 +++++
 src/readelf.c | 8 ++++----
 2 files changed, 9 insertions(+), 4 deletions(-)

diff --git a/src/ChangeLog b/src/ChangeLog
index db20a6ef..42ce6640 100644
--- a/src/ChangeLog
+++ b/src/ChangeLog
@@ -1,3 +1,8 @@
+2022-08-01  Mark Wielaard  <mark@klomp.org>
+
+	* readelf.c (handle_dynamic): Pass start of buffer to memrchr.
+	Use dyn->d_un.d_val for offsets instead of d_ptr.
+
 2022-04-28  Di Chen  <dichen@redhat.com>
 
 	* readelf.c (options): Add use-dynamic 'D'.
diff --git a/src/readelf.c b/src/readelf.c
index f4d973da..f1f77ce8 100644
--- a/src/readelf.c
+++ b/src/readelf.c
@@ -1905,10 +1905,10 @@ handle_dynamic (Ebl *ebl, Elf_Scn *scn, GElf_Shdr *shdr, GElf_Phdr *phdr)
 	{
 	  if (! use_dynamic_segment)
 	    name = elf_strptr (ebl->elf, shdr->sh_link, dyn->d_un.d_val);
-	  else if (dyn->d_un.d_ptr < strtab_data->d_size
-		   && memrchr (strtab_data->d_buf + strtab_data->d_size - 1, '\0',
-			       strtab_data->d_size - 1 - dyn->d_un.d_ptr) != NULL)
-	    name = ((char *) strtab_data->d_buf) + dyn->d_un.d_ptr;
+	  else if (dyn->d_un.d_val < strtab_data->d_size
+		   && memrchr (strtab_data->d_buf + dyn->d_un.d_val, '\0',
+			       strtab_data->d_size - 1 - dyn->d_un.d_val) != NULL)
+	    name = ((char *) strtab_data->d_buf) + dyn->d_un.d_val;
 	}
 
       switch (dyn->d_tag)
-- 
2.30.2


^ permalink raw reply	[flat|nested] 41+ messages in thread

* ☠ Buildbot (GNU Toolchain): elfutils - failed test (failure) (master)
@ 2022-11-28 13:30 builder
  0 siblings, 0 replies; 41+ messages in thread
From: builder @ 2022-11-28 13:30 UTC (permalink / raw)
  To: elfutils-devel

A new failure has been detected on builder elfutils-debian-armhf while building elfutils.

Full details are available at:
    https://builder.sourceware.org/buildbot/#builders/6/builds/105

Build state: failed test (failure)
Revision: 98bdf533c4990728f0db653ab4e98a503d7654ce
Worker: debian-armhf
Build Reason: (unknown)
Blamelist: Martin Liska <mliska@suse.cz>

Steps:

- 0: worker_preparation ( success )

- 1: set package name ( success )

- 2: git checkout ( success )
    Logs:
        - stdio: https://builder.sourceware.org/buildbot/#builders/6/builds/105/steps/2/logs/stdio

- 3: autoreconf ( success )
    Logs:
        - stdio: https://builder.sourceware.org/buildbot/#builders/6/builds/105/steps/3/logs/stdio

- 4: configure ( success )
    Logs:
        - stdio: https://builder.sourceware.org/buildbot/#builders/6/builds/105/steps/4/logs/stdio

- 5: get version ( success )
    Logs:
        - stdio: https://builder.sourceware.org/buildbot/#builders/6/builds/105/steps/5/logs/stdio
        - property changes: https://builder.sourceware.org/buildbot/#builders/6/builds/105/steps/5/logs/property_changes

- 6: make ( warnings )
    Logs:
        - stdio: https://builder.sourceware.org/buildbot/#builders/6/builds/105/steps/6/logs/stdio
        - warnings (3): https://builder.sourceware.org/buildbot/#builders/6/builds/105/steps/6/logs/warnings__3_

- 7: make check ( failure )
    Logs:
        - stdio: https://builder.sourceware.org/buildbot/#builders/6/builds/105/steps/7/logs/stdio
        - test-suite.log: https://builder.sourceware.org/buildbot/#builders/6/builds/105/steps/7/logs/test-suite_log

- 8: prep ( success )
    Logs:
        - stdio: https://builder.sourceware.org/buildbot/#builders/6/builds/105/steps/8/logs/stdio

- 9: build bunsen.cpio.gz ( success )
    Logs:
        - stdio: https://builder.sourceware.org/buildbot/#builders/6/builds/105/steps/9/logs/stdio

- 10: fetch bunsen.cpio.gz ( success )
    Logs:
        - stdio: https://builder.sourceware.org/buildbot/#builders/6/builds/105/steps/10/logs/stdio

- 11: unpack bunsen.cpio.gz ( success )
    Logs:
        - stdio: https://builder.sourceware.org/buildbot/#builders/6/builds/105/steps/11/logs/stdio

- 12: pass .bunsen.source.gitname ( success )
    Logs:
        - stdio: https://builder.sourceware.org/buildbot/#builders/6/builds/105/steps/12/logs/stdio

- 13: pass .bunsen.source.gitdescribe ( success )
    Logs:
        - stdio: https://builder.sourceware.org/buildbot/#builders/6/builds/105/steps/13/logs/stdio

- 14: pass .bunsen.source.gitbranch ( success )
    Logs:
        - stdio: https://builder.sourceware.org/buildbot/#builders/6/builds/105/steps/14/logs/stdio

- 15: pass .bunsen.source.gitrepo ( success )
    Logs:
        - stdio: https://builder.sourceware.org/buildbot/#builders/6/builds/105/steps/15/logs/stdio

- 16: upload to bunsen ( success )
    Logs:
        - stdio: https://builder.sourceware.org/buildbot/#builders/6/builds/105/steps/16/logs/stdio

- 17: clean up ( success )
    Logs:
        - stdio: https://builder.sourceware.org/buildbot/#builders/6/builds/105/steps/17/logs/stdio

- 18: make distclean ( success )
    Logs:
        - stdio: https://builder.sourceware.org/buildbot/#builders/6/builds/105/steps/18/logs/stdio


^ permalink raw reply	[flat|nested] 41+ messages in thread

* ☠ Buildbot (GNU Toolchain): elfutils - failed test (failure) (master)
@ 2022-11-04 22:29 builder
  0 siblings, 0 replies; 41+ messages in thread
From: builder @ 2022-11-04 22:29 UTC (permalink / raw)
  To: elfutils-devel

A new failure has been detected on builder elfutils-centos-x86_64 while building elfutils.

Full details are available at:
    https://builder.sourceware.org/buildbot/#builders/39/builds/105

Build state: failed test (failure)
Revision: 4628be9e03db78eaf2b02e9aa6cc677a0b4319ea
Worker: centos-x86_64
Build Reason: (unknown)
Blamelist: Aaron Merey <amerey@redhat.com>

Steps:

- 0: worker_preparation ( success )

- 1: set package name ( success )

- 2: git checkout ( success )
    Logs:
        - stdio: https://builder.sourceware.org/buildbot/#builders/39/builds/105/steps/2/logs/stdio

- 3: autoreconf ( success )
    Logs:
        - stdio: https://builder.sourceware.org/buildbot/#builders/39/builds/105/steps/3/logs/stdio

- 4: configure ( success )
    Logs:
        - stdio: https://builder.sourceware.org/buildbot/#builders/39/builds/105/steps/4/logs/stdio

- 5: get version ( success )
    Logs:
        - stdio: https://builder.sourceware.org/buildbot/#builders/39/builds/105/steps/5/logs/stdio
        - property changes: https://builder.sourceware.org/buildbot/#builders/39/builds/105/steps/5/logs/property_changes

- 6: make ( warnings )
    Logs:
        - stdio: https://builder.sourceware.org/buildbot/#builders/39/builds/105/steps/6/logs/stdio
        - warnings (2): https://builder.sourceware.org/buildbot/#builders/39/builds/105/steps/6/logs/warnings__2_

- 7: make check ( failure )
    Logs:
        - stdio: https://builder.sourceware.org/buildbot/#builders/39/builds/105/steps/7/logs/stdio
        - test-suite.log: https://builder.sourceware.org/buildbot/#builders/39/builds/105/steps/7/logs/test-suite_log

- 8: prep ( success )
    Logs:
        - stdio: https://builder.sourceware.org/buildbot/#builders/39/builds/105/steps/8/logs/stdio

- 9: build bunsen.cpio.gz ( success )
    Logs:
        - stdio: https://builder.sourceware.org/buildbot/#builders/39/builds/105/steps/9/logs/stdio

- 10: fetch bunsen.cpio.gz ( success )
    Logs:
        - stdio: https://builder.sourceware.org/buildbot/#builders/39/builds/105/steps/10/logs/stdio

- 11: unpack bunsen.cpio.gz ( success )
    Logs:
        - stdio: https://builder.sourceware.org/buildbot/#builders/39/builds/105/steps/11/logs/stdio

- 12: pass .bunsen.source.gitname ( success )
    Logs:
        - stdio: https://builder.sourceware.org/buildbot/#builders/39/builds/105/steps/12/logs/stdio

- 13: pass .bunsen.source.gitdescribe ( success )
    Logs:
        - stdio: https://builder.sourceware.org/buildbot/#builders/39/builds/105/steps/13/logs/stdio

- 14: pass .bunsen.source.gitbranch ( success )
    Logs:
        - stdio: https://builder.sourceware.org/buildbot/#builders/39/builds/105/steps/14/logs/stdio

- 15: pass .bunsen.source.gitrepo ( success )
    Logs:
        - stdio: https://builder.sourceware.org/buildbot/#builders/39/builds/105/steps/15/logs/stdio

- 16: upload to bunsen ( success )
    Logs:
        - stdio: https://builder.sourceware.org/buildbot/#builders/39/builds/105/steps/16/logs/stdio

- 17: clean up ( success )
    Logs:
        - stdio: https://builder.sourceware.org/buildbot/#builders/39/builds/105/steps/17/logs/stdio

- 18: make distclean ( success )
    Logs:
        - stdio: https://builder.sourceware.org/buildbot/#builders/39/builds/105/steps/18/logs/stdio


^ permalink raw reply	[flat|nested] 41+ messages in thread

* ☠ Buildbot (GNU Toolchain): elfutils - failed test (failure) (master)
@ 2022-11-03 15:27 builder
  0 siblings, 0 replies; 41+ messages in thread
From: builder @ 2022-11-03 15:27 UTC (permalink / raw)
  To: elfutils-devel

A new failure has been detected on builder elfutils-fedora-x86_64 while building elfutils.

Full details are available at:
    https://builder.sourceware.org/buildbot/#builders/59/builds/107

Build state: failed test (failure)
Revision: b0a0235771906e3bcd6174c4e3c020b5522b0be5
Worker: bb1-2
Build Reason: (unknown)
Blamelist: Mark Wielaard <mark@klomp.org>

Steps:

- 0: worker_preparation ( success )

- 1: set package name ( success )

- 2: git checkout ( success )
    Logs:
        - stdio: https://builder.sourceware.org/buildbot/#builders/59/builds/107/steps/2/logs/stdio

- 3: autoreconf ( success )
    Logs:
        - stdio: https://builder.sourceware.org/buildbot/#builders/59/builds/107/steps/3/logs/stdio

- 4: configure ( success )
    Logs:
        - stdio: https://builder.sourceware.org/buildbot/#builders/59/builds/107/steps/4/logs/stdio

- 5: get version ( success )
    Logs:
        - stdio: https://builder.sourceware.org/buildbot/#builders/59/builds/107/steps/5/logs/stdio
        - property changes: https://builder.sourceware.org/buildbot/#builders/59/builds/107/steps/5/logs/property_changes

- 6: make ( warnings )
    Logs:
        - stdio: https://builder.sourceware.org/buildbot/#builders/59/builds/107/steps/6/logs/stdio
        - warnings (3): https://builder.sourceware.org/buildbot/#builders/59/builds/107/steps/6/logs/warnings__3_

- 7: make check ( success )
    Logs:
        - stdio: https://builder.sourceware.org/buildbot/#builders/59/builds/107/steps/7/logs/stdio
        - test-suite.log: https://builder.sourceware.org/buildbot/#builders/59/builds/107/steps/7/logs/test-suite_log

- 8: make distcheck ( failure )
    Logs:
        - stdio: https://builder.sourceware.org/buildbot/#builders/59/builds/107/steps/8/logs/stdio
        - test-suite.log: https://builder.sourceware.org/buildbot/#builders/59/builds/107/steps/8/logs/test-suite_log
        - warnings (4): https://builder.sourceware.org/buildbot/#builders/59/builds/107/steps/8/logs/warnings__4_

- 9: prep ( success )
    Logs:
        - stdio: https://builder.sourceware.org/buildbot/#builders/59/builds/107/steps/9/logs/stdio

- 10: build bunsen.cpio.gz ( success )
    Logs:
        - stdio: https://builder.sourceware.org/buildbot/#builders/59/builds/107/steps/10/logs/stdio

- 11: fetch bunsen.cpio.gz ( success )
    Logs:
        - stdio: https://builder.sourceware.org/buildbot/#builders/59/builds/107/steps/11/logs/stdio

- 12: unpack bunsen.cpio.gz ( success )
    Logs:
        - stdio: https://builder.sourceware.org/buildbot/#builders/59/builds/107/steps/12/logs/stdio

- 13: pass .bunsen.source.gitname ( success )
    Logs:
        - stdio: https://builder.sourceware.org/buildbot/#builders/59/builds/107/steps/13/logs/stdio

- 14: pass .bunsen.source.gitdescribe ( success )
    Logs:
        - stdio: https://builder.sourceware.org/buildbot/#builders/59/builds/107/steps/14/logs/stdio

- 15: pass .bunsen.source.gitbranch ( success )
    Logs:
        - stdio: https://builder.sourceware.org/buildbot/#builders/59/builds/107/steps/15/logs/stdio

- 16: pass .bunsen.source.gitrepo ( success )
    Logs:
        - stdio: https://builder.sourceware.org/buildbot/#builders/59/builds/107/steps/16/logs/stdio

- 17: upload to bunsen ( success )
    Logs:
        - stdio: https://builder.sourceware.org/buildbot/#builders/59/builds/107/steps/17/logs/stdio

- 18: clean up ( success )
    Logs:
        - stdio: https://builder.sourceware.org/buildbot/#builders/59/builds/107/steps/18/logs/stdio

- 19: make distclean ( success )
    Logs:
        - stdio: https://builder.sourceware.org/buildbot/#builders/59/builds/107/steps/19/logs/stdio


^ permalink raw reply	[flat|nested] 41+ messages in thread

* Re: ☠ Buildbot (GNU Toolchain): elfutils - failed test (failure) (master)
  2022-11-02 13:39 builder
@ 2022-11-02 14:19 ` Mark Wielaard
  0 siblings, 0 replies; 41+ messages in thread
From: Mark Wielaard @ 2022-11-02 14:19 UTC (permalink / raw)
  To: elfutils-devel

Hi,

On Wed, 2022-11-02 at 13:39 +0000, builder--- via Elfutils-devel wrote:
> A new failure has been detected on builder elfutils-centos-x86_64
> while building elfutils.
> 
> Full details are available at:
>     https://builder.sourceware.org/buildbot/#builders/39/builds/99
> 
> Build state: failed test (failure)
> Revision: e9f3045caa5c4498f371383e5519151942d48b6d
> Worker: centos-x86_64
> Build Reason: (unknown)
> Blamelist: Mark Wielaard <mark@klomp.org>
> 
> Steps:
> [...]
> https://builder.sourceware.org/buildbot/#builders/39/builds/99/steps/6/logs/warnings__2_
> 
> - 7: make check ( failure )
>     Logs:
>         - stdio: 
> https://builder.sourceware.org/buildbot/#builders/39/builds/99/steps/7/logs/stdio
>         - test-suite.log: 
> https://builder.sourceware.org/buildbot/#builders/39/builds/99/steps/7/logs/test-suite_log

So this is run-backtrace-native-core-biarch.sh which only occasionally
fails. It also fails on on debian-testing. It looks like the pc is off
when the core file is generated, which might be a kernel issue, but I
don't understand why it only happens sometimes. Might be because there
are two threads running?

It seems we have two tests that occasionally fail. Which is not good.
But also not that bad that it should stop the release imho.

Cheers,

Mark

^ permalink raw reply	[flat|nested] 41+ messages in thread

* ☠ Buildbot (GNU Toolchain): elfutils - failed test (failure) (master)
@ 2022-11-02 13:39 builder
  2022-11-02 14:19 ` Mark Wielaard
  0 siblings, 1 reply; 41+ messages in thread
From: builder @ 2022-11-02 13:39 UTC (permalink / raw)
  To: elfutils-devel

A new failure has been detected on builder elfutils-centos-x86_64 while building elfutils.

Full details are available at:
    https://builder.sourceware.org/buildbot/#builders/39/builds/99

Build state: failed test (failure)
Revision: e9f3045caa5c4498f371383e5519151942d48b6d
Worker: centos-x86_64
Build Reason: (unknown)
Blamelist: Mark Wielaard <mark@klomp.org>

Steps:

- 0: worker_preparation ( success )

- 1: set package name ( success )

- 2: git checkout ( success )
    Logs:
        - stdio: https://builder.sourceware.org/buildbot/#builders/39/builds/99/steps/2/logs/stdio

- 3: autoreconf ( success )
    Logs:
        - stdio: https://builder.sourceware.org/buildbot/#builders/39/builds/99/steps/3/logs/stdio

- 4: configure ( success )
    Logs:
        - stdio: https://builder.sourceware.org/buildbot/#builders/39/builds/99/steps/4/logs/stdio

- 5: get version ( success )
    Logs:
        - stdio: https://builder.sourceware.org/buildbot/#builders/39/builds/99/steps/5/logs/stdio
        - property changes: https://builder.sourceware.org/buildbot/#builders/39/builds/99/steps/5/logs/property_changes

- 6: make ( warnings )
    Logs:
        - stdio: https://builder.sourceware.org/buildbot/#builders/39/builds/99/steps/6/logs/stdio
        - warnings (2): https://builder.sourceware.org/buildbot/#builders/39/builds/99/steps/6/logs/warnings__2_

- 7: make check ( failure )
    Logs:
        - stdio: https://builder.sourceware.org/buildbot/#builders/39/builds/99/steps/7/logs/stdio
        - test-suite.log: https://builder.sourceware.org/buildbot/#builders/39/builds/99/steps/7/logs/test-suite_log

- 8: prep ( success )
    Logs:
        - stdio: https://builder.sourceware.org/buildbot/#builders/39/builds/99/steps/8/logs/stdio

- 9: build bunsen.cpio.gz ( success )
    Logs:
        - stdio: https://builder.sourceware.org/buildbot/#builders/39/builds/99/steps/9/logs/stdio

- 10: fetch bunsen.cpio.gz ( success )
    Logs:
        - stdio: https://builder.sourceware.org/buildbot/#builders/39/builds/99/steps/10/logs/stdio

- 11: unpack bunsen.cpio.gz ( success )
    Logs:
        - stdio: https://builder.sourceware.org/buildbot/#builders/39/builds/99/steps/11/logs/stdio

- 12: pass .bunsen.source.gitname ( success )
    Logs:
        - stdio: https://builder.sourceware.org/buildbot/#builders/39/builds/99/steps/12/logs/stdio

- 13: pass .bunsen.source.gitdescribe ( success )
    Logs:
        - stdio: https://builder.sourceware.org/buildbot/#builders/39/builds/99/steps/13/logs/stdio

- 14: pass .bunsen.source.gitbranch ( success )
    Logs:
        - stdio: https://builder.sourceware.org/buildbot/#builders/39/builds/99/steps/14/logs/stdio

- 15: pass .bunsen.source.gitrepo ( success )
    Logs:
        - stdio: https://builder.sourceware.org/buildbot/#builders/39/builds/99/steps/15/logs/stdio

- 16: upload to bunsen ( success )
    Logs:
        - stdio: https://builder.sourceware.org/buildbot/#builders/39/builds/99/steps/16/logs/stdio

- 17: clean up ( success )
    Logs:
        - stdio: https://builder.sourceware.org/buildbot/#builders/39/builds/99/steps/17/logs/stdio

- 18: make distclean ( success )
    Logs:
        - stdio: https://builder.sourceware.org/buildbot/#builders/39/builds/99/steps/18/logs/stdio

A restored build has been detected on builder elfutils-fedora-ppc64le while building elfutils.

Full details are available at:
    https://builder.sourceware.org/buildbot/#builders/55/builds/97

Build state: build successful
Revision: e9f3045caa5c4498f371383e5519151942d48b6d
Worker: fedora-ppc64le
Build Reason: (unknown)
Blamelist: Aaron Merey <amerey@redhat.com>, Mark Wielaard <mark@klomp.org>

Steps:

- 0: worker_preparation ( success )

- 1: set package name ( success )

- 2: git checkout ( success )
    Logs:
        - stdio: https://builder.sourceware.org/buildbot/#builders/55/builds/97/steps/2/logs/stdio

- 3: autoreconf ( success )
    Logs:
        - stdio: https://builder.sourceware.org/buildbot/#builders/55/builds/97/steps/3/logs/stdio

- 4: configure ( success )
    Logs:
        - stdio: https://builder.sourceware.org/buildbot/#builders/55/builds/97/steps/4/logs/stdio

- 5: get version ( success )
    Logs:
        - stdio: https://builder.sourceware.org/buildbot/#builders/55/builds/97/steps/5/logs/stdio
        - property changes: https://builder.sourceware.org/buildbot/#builders/55/builds/97/steps/5/logs/property_changes

- 6: make ( warnings )
    Logs:
        - stdio: https://builder.sourceware.org/buildbot/#builders/55/builds/97/steps/6/logs/stdio
        - warnings (3): https://builder.sourceware.org/buildbot/#builders/55/builds/97/steps/6/logs/warnings__3_

- 7: make check ( success )
    Logs:
        - stdio: https://builder.sourceware.org/buildbot/#builders/55/builds/97/steps/7/logs/stdio
        - test-suite.log: https://builder.sourceware.org/buildbot/#builders/55/builds/97/steps/7/logs/test-suite_log

- 8: prep ( success )
    Logs:
        - stdio: https://builder.sourceware.org/buildbot/#builders/55/builds/97/steps/8/logs/stdio

- 9: build bunsen.cpio.gz ( success )
    Logs:
        - stdio: https://builder.sourceware.org/buildbot/#builders/55/builds/97/steps/9/logs/stdio

- 10: fetch bunsen.cpio.gz ( success )
    Logs:
        - stdio: https://builder.sourceware.org/buildbot/#builders/55/builds/97/steps/10/logs/stdio

- 11: unpack bunsen.cpio.gz ( success )
    Logs:
        - stdio: https://builder.sourceware.org/buildbot/#builders/55/builds/97/steps/11/logs/stdio

- 12: pass .bunsen.source.gitname ( success )
    Logs:
        - stdio: https://builder.sourceware.org/buildbot/#builders/55/builds/97/steps/12/logs/stdio

- 13: pass .bunsen.source.gitdescribe ( success )
    Logs:
        - stdio: https://builder.sourceware.org/buildbot/#builders/55/builds/97/steps/13/logs/stdio

- 14: pass .bunsen.source.gitbranch ( success )
    Logs:
        - stdio: https://builder.sourceware.org/buildbot/#builders/55/builds/97/steps/14/logs/stdio

- 15: pass .bunsen.source.gitrepo ( success )
    Logs:
        - stdio: https://builder.sourceware.org/buildbot/#builders/55/builds/97/steps/15/logs/stdio

- 16: upload to bunsen ( success )
    Logs:
        - stdio: https://builder.sourceware.org/buildbot/#builders/55/builds/97/steps/16/logs/stdio

- 17: clean up ( success )
    Logs:
        - stdio: https://builder.sourceware.org/buildbot/#builders/55/builds/97/steps/17/logs/stdio

- 18: make distclean ( success )
    Logs:
        - stdio: https://builder.sourceware.org/buildbot/#builders/55/builds/97/steps/18/logs/stdio


^ permalink raw reply	[flat|nested] 41+ messages in thread

* Re: ☠ Buildbot (GNU Toolchain): elfutils - failed test (failure) (master)
  2022-11-02  1:15 builder
@ 2022-11-02 12:06 ` Mark Wielaard
  0 siblings, 0 replies; 41+ messages in thread
From: Mark Wielaard @ 2022-11-02 12:06 UTC (permalink / raw)
  To: elfutils-devel

Hi,

On Wed, 2022-11-02 at 01:15 +0000, builder--- via Elfutils-devel wrote:
> A new failure has been detected on builder elfutils-fedora-ppc64le
> while building elfutils.
> 
> Full details are available at:
>     https://builder.sourceware.org/buildbot/#builders/55/builds/96
> 
> Build state: failed test (failure)
> Revision: f0f155569c6859c5bc529c0279a6b4803aac950f
> Worker: fedora-ppc64le
> Build Reason: (unknown)
> Blamelist: Aaron Merey <amerey@redhat.com>
> 
> Steps:
> [...]
> - 7: make check ( failure )
>     Logs:
>         - stdio: 
> https://builder.sourceware.org/buildbot/#builders/55/builds/96/steps/7/logs/stdio
>         - test-suite.log: 
> https://builder.sourceware.org/buildbot/#builders/55/builds/96/steps/7/logs/test-suite_log

This was not because of any of Aaron's commits (thanks for the
fixups!). This is the run-debuginfod-federation-metrics.sh crash in
libmicrohttpd (version 0.9.75):

libmicrohttpd error: Call to epoll_ctl failed: Bad file descriptor
Fatal error in GNU libmicrohttpd daemon.c:2927: Close socket failed.

Still don't know why that is sometimes triggered. It does seem to be
caused by the latest libmicrohttpd release. But only occasionally.

Cheers,

Mark

^ permalink raw reply	[flat|nested] 41+ messages in thread

* ☠ Buildbot (GNU Toolchain): elfutils - failed test (failure) (master)
@ 2022-11-02  1:15 builder
  2022-11-02 12:06 ` Mark Wielaard
  0 siblings, 1 reply; 41+ messages in thread
From: builder @ 2022-11-02  1:15 UTC (permalink / raw)
  To: elfutils-devel

A new failure has been detected on builder elfutils-fedora-ppc64le while building elfutils.

Full details are available at:
    https://builder.sourceware.org/buildbot/#builders/55/builds/96

Build state: failed test (failure)
Revision: f0f155569c6859c5bc529c0279a6b4803aac950f
Worker: fedora-ppc64le
Build Reason: (unknown)
Blamelist: Aaron Merey <amerey@redhat.com>

Steps:

- 0: worker_preparation ( success )

- 1: set package name ( success )

- 2: git checkout ( success )
    Logs:
        - stdio: https://builder.sourceware.org/buildbot/#builders/55/builds/96/steps/2/logs/stdio

- 3: autoreconf ( success )
    Logs:
        - stdio: https://builder.sourceware.org/buildbot/#builders/55/builds/96/steps/3/logs/stdio

- 4: configure ( success )
    Logs:
        - stdio: https://builder.sourceware.org/buildbot/#builders/55/builds/96/steps/4/logs/stdio

- 5: get version ( success )
    Logs:
        - stdio: https://builder.sourceware.org/buildbot/#builders/55/builds/96/steps/5/logs/stdio
        - property changes: https://builder.sourceware.org/buildbot/#builders/55/builds/96/steps/5/logs/property_changes

- 6: make ( warnings )
    Logs:
        - stdio: https://builder.sourceware.org/buildbot/#builders/55/builds/96/steps/6/logs/stdio
        - warnings (3): https://builder.sourceware.org/buildbot/#builders/55/builds/96/steps/6/logs/warnings__3_

- 7: make check ( failure )
    Logs:
        - stdio: https://builder.sourceware.org/buildbot/#builders/55/builds/96/steps/7/logs/stdio
        - test-suite.log: https://builder.sourceware.org/buildbot/#builders/55/builds/96/steps/7/logs/test-suite_log

- 8: prep ( success )
    Logs:
        - stdio: https://builder.sourceware.org/buildbot/#builders/55/builds/96/steps/8/logs/stdio

- 9: build bunsen.cpio.gz ( success )
    Logs:
        - stdio: https://builder.sourceware.org/buildbot/#builders/55/builds/96/steps/9/logs/stdio

- 10: fetch bunsen.cpio.gz ( success )
    Logs:
        - stdio: https://builder.sourceware.org/buildbot/#builders/55/builds/96/steps/10/logs/stdio

- 11: unpack bunsen.cpio.gz ( success )
    Logs:
        - stdio: https://builder.sourceware.org/buildbot/#builders/55/builds/96/steps/11/logs/stdio

- 12: pass .bunsen.source.gitname ( success )
    Logs:
        - stdio: https://builder.sourceware.org/buildbot/#builders/55/builds/96/steps/12/logs/stdio

- 13: pass .bunsen.source.gitdescribe ( success )
    Logs:
        - stdio: https://builder.sourceware.org/buildbot/#builders/55/builds/96/steps/13/logs/stdio

- 14: pass .bunsen.source.gitbranch ( success )
    Logs:
        - stdio: https://builder.sourceware.org/buildbot/#builders/55/builds/96/steps/14/logs/stdio

- 15: pass .bunsen.source.gitrepo ( success )
    Logs:
        - stdio: https://builder.sourceware.org/buildbot/#builders/55/builds/96/steps/15/logs/stdio

- 16: upload to bunsen ( success )
    Logs:
        - stdio: https://builder.sourceware.org/buildbot/#builders/55/builds/96/steps/16/logs/stdio

- 17: clean up ( success )
    Logs:
        - stdio: https://builder.sourceware.org/buildbot/#builders/55/builds/96/steps/17/logs/stdio

- 18: make distclean ( success )
    Logs:
        - stdio: https://builder.sourceware.org/buildbot/#builders/55/builds/96/steps/18/logs/stdio


^ permalink raw reply	[flat|nested] 41+ messages in thread

* ☠ Buildbot (GNU Toolchain): elfutils - failed test (failure) (master)
@ 2022-11-01 21:28 builder
  0 siblings, 0 replies; 41+ messages in thread
From: builder @ 2022-11-01 21:28 UTC (permalink / raw)
  To: elfutils-devel

A new failure has been detected on builder elfutils-debian-armhf while building elfutils.

Full details are available at:
    https://builder.sourceware.org/buildbot/#builders/6/builds/93

Build state: failed test (failure)
Revision: fb833750c395ce268d16fd44e4decafbb41208a8
Worker: debian-armhf
Build Reason: (unknown)
Blamelist: Aaron Merey <amerey@redhat.com>

Steps:

- 0: worker_preparation ( success )

- 1: set package name ( success )

- 2: git checkout ( success )
    Logs:
        - stdio: https://builder.sourceware.org/buildbot/#builders/6/builds/93/steps/2/logs/stdio

- 3: autoreconf ( success )
    Logs:
        - stdio: https://builder.sourceware.org/buildbot/#builders/6/builds/93/steps/3/logs/stdio

- 4: configure ( success )
    Logs:
        - stdio: https://builder.sourceware.org/buildbot/#builders/6/builds/93/steps/4/logs/stdio

- 5: get version ( success )
    Logs:
        - stdio: https://builder.sourceware.org/buildbot/#builders/6/builds/93/steps/5/logs/stdio
        - property changes: https://builder.sourceware.org/buildbot/#builders/6/builds/93/steps/5/logs/property_changes

- 6: make ( warnings )
    Logs:
        - stdio: https://builder.sourceware.org/buildbot/#builders/6/builds/93/steps/6/logs/stdio
        - warnings (3): https://builder.sourceware.org/buildbot/#builders/6/builds/93/steps/6/logs/warnings__3_

- 7: make check ( failure )
    Logs:
        - stdio: https://builder.sourceware.org/buildbot/#builders/6/builds/93/steps/7/logs/stdio
        - test-suite.log: https://builder.sourceware.org/buildbot/#builders/6/builds/93/steps/7/logs/test-suite_log

- 8: prep ( success )
    Logs:
        - stdio: https://builder.sourceware.org/buildbot/#builders/6/builds/93/steps/8/logs/stdio

- 9: build bunsen.cpio.gz ( success )
    Logs:
        - stdio: https://builder.sourceware.org/buildbot/#builders/6/builds/93/steps/9/logs/stdio

- 10: fetch bunsen.cpio.gz ( success )
    Logs:
        - stdio: https://builder.sourceware.org/buildbot/#builders/6/builds/93/steps/10/logs/stdio

- 11: unpack bunsen.cpio.gz ( success )
    Logs:
        - stdio: https://builder.sourceware.org/buildbot/#builders/6/builds/93/steps/11/logs/stdio

- 12: pass .bunsen.source.gitname ( success )
    Logs:
        - stdio: https://builder.sourceware.org/buildbot/#builders/6/builds/93/steps/12/logs/stdio

- 13: pass .bunsen.source.gitdescribe ( success )
    Logs:
        - stdio: https://builder.sourceware.org/buildbot/#builders/6/builds/93/steps/13/logs/stdio

- 14: pass .bunsen.source.gitbranch ( success )
    Logs:
        - stdio: https://builder.sourceware.org/buildbot/#builders/6/builds/93/steps/14/logs/stdio

- 15: pass .bunsen.source.gitrepo ( success )
    Logs:
        - stdio: https://builder.sourceware.org/buildbot/#builders/6/builds/93/steps/15/logs/stdio

- 16: upload to bunsen ( success )
    Logs:
        - stdio: https://builder.sourceware.org/buildbot/#builders/6/builds/93/steps/16/logs/stdio

- 17: clean up ( success )
    Logs:
        - stdio: https://builder.sourceware.org/buildbot/#builders/6/builds/93/steps/17/logs/stdio

- 18: make distclean ( success )
    Logs:
        - stdio: https://builder.sourceware.org/buildbot/#builders/6/builds/93/steps/18/logs/stdio

A new failure has been detected on builder elfutils-debian-i386 while building elfutils.

Full details are available at:
    https://builder.sourceware.org/buildbot/#builders/17/builds/93

Build state: failed test (failure)
Revision: fb833750c395ce268d16fd44e4decafbb41208a8
Worker: debian-i386-2
Build Reason: (unknown)
Blamelist: Aaron Merey <amerey@redhat.com>

Steps:

- 0: worker_preparation ( success )

- 1: set package name ( success )

- 2: git checkout ( success )
    Logs:
        - stdio: https://builder.sourceware.org/buildbot/#builders/17/builds/93/steps/2/logs/stdio

- 3: autoreconf ( success )
    Logs:
        - stdio: https://builder.sourceware.org/buildbot/#builders/17/builds/93/steps/3/logs/stdio

- 4: configure ( success )
    Logs:
        - stdio: https://builder.sourceware.org/buildbot/#builders/17/builds/93/steps/4/logs/stdio

- 5: get version ( success )
    Logs:
        - stdio: https://builder.sourceware.org/buildbot/#builders/17/builds/93/steps/5/logs/stdio
        - property changes: https://builder.sourceware.org/buildbot/#builders/17/builds/93/steps/5/logs/property_changes

- 6: make ( warnings )
    Logs:
        - stdio: https://builder.sourceware.org/buildbot/#builders/17/builds/93/steps/6/logs/stdio
        - warnings (3): https://builder.sourceware.org/buildbot/#builders/17/builds/93/steps/6/logs/warnings__3_

- 7: make check ( failure )
    Logs:
        - stdio: https://builder.sourceware.org/buildbot/#builders/17/builds/93/steps/7/logs/stdio
        - test-suite.log: https://builder.sourceware.org/buildbot/#builders/17/builds/93/steps/7/logs/test-suite_log

- 8: prep ( success )
    Logs:
        - stdio: https://builder.sourceware.org/buildbot/#builders/17/builds/93/steps/8/logs/stdio

- 9: build bunsen.cpio.gz ( success )
    Logs:
        - stdio: https://builder.sourceware.org/buildbot/#builders/17/builds/93/steps/9/logs/stdio

- 10: fetch bunsen.cpio.gz ( success )
    Logs:
        - stdio: https://builder.sourceware.org/buildbot/#builders/17/builds/93/steps/10/logs/stdio

- 11: unpack bunsen.cpio.gz ( success )
    Logs:
        - stdio: https://builder.sourceware.org/buildbot/#builders/17/builds/93/steps/11/logs/stdio

- 12: pass .bunsen.source.gitname ( success )
    Logs:
        - stdio: https://builder.sourceware.org/buildbot/#builders/17/builds/93/steps/12/logs/stdio

- 13: pass .bunsen.source.gitdescribe ( success )
    Logs:
        - stdio: https://builder.sourceware.org/buildbot/#builders/17/builds/93/steps/13/logs/stdio

- 14: pass .bunsen.source.gitbranch ( success )
    Logs:
        - stdio: https://builder.sourceware.org/buildbot/#builders/17/builds/93/steps/14/logs/stdio

- 15: pass .bunsen.source.gitrepo ( success )
    Logs:
        - stdio: https://builder.sourceware.org/buildbot/#builders/17/builds/93/steps/15/logs/stdio

- 16: upload to bunsen ( success )
    Logs:
        - stdio: https://builder.sourceware.org/buildbot/#builders/17/builds/93/steps/16/logs/stdio

- 17: clean up ( success )
    Logs:
        - stdio: https://builder.sourceware.org/buildbot/#builders/17/builds/93/steps/17/logs/stdio

- 18: make distclean ( success )
    Logs:
        - stdio: https://builder.sourceware.org/buildbot/#builders/17/builds/93/steps/18/logs/stdio

A new failure has been detected on builder elfutils-centos-x86_64 while building elfutils.

Full details are available at:
    https://builder.sourceware.org/buildbot/#builders/39/builds/95

Build state: failed test (failure)
Revision: fb833750c395ce268d16fd44e4decafbb41208a8
Worker: centos-x86_64
Build Reason: (unknown)
Blamelist: Aaron Merey <amerey@redhat.com>

Steps:

- 0: worker_preparation ( success )

- 1: set package name ( success )

- 2: git checkout ( success )
    Logs:
        - stdio: https://builder.sourceware.org/buildbot/#builders/39/builds/95/steps/2/logs/stdio

- 3: autoreconf ( success )
    Logs:
        - stdio: https://builder.sourceware.org/buildbot/#builders/39/builds/95/steps/3/logs/stdio

- 4: configure ( success )
    Logs:
        - stdio: https://builder.sourceware.org/buildbot/#builders/39/builds/95/steps/4/logs/stdio

- 5: get version ( success )
    Logs:
        - stdio: https://builder.sourceware.org/buildbot/#builders/39/builds/95/steps/5/logs/stdio
        - property changes: https://builder.sourceware.org/buildbot/#builders/39/builds/95/steps/5/logs/property_changes

- 6: make ( warnings )
    Logs:
        - stdio: https://builder.sourceware.org/buildbot/#builders/39/builds/95/steps/6/logs/stdio
        - warnings (2): https://builder.sourceware.org/buildbot/#builders/39/builds/95/steps/6/logs/warnings__2_

- 7: make check ( failure )
    Logs:
        - stdio: https://builder.sourceware.org/buildbot/#builders/39/builds/95/steps/7/logs/stdio
        - test-suite.log: https://builder.sourceware.org/buildbot/#builders/39/builds/95/steps/7/logs/test-suite_log

- 8: prep ( success )
    Logs:
        - stdio: https://builder.sourceware.org/buildbot/#builders/39/builds/95/steps/8/logs/stdio

- 9: build bunsen.cpio.gz ( success )
    Logs:
        - stdio: https://builder.sourceware.org/buildbot/#builders/39/builds/95/steps/9/logs/stdio

- 10: fetch bunsen.cpio.gz ( success )
    Logs:
        - stdio: https://builder.sourceware.org/buildbot/#builders/39/builds/95/steps/10/logs/stdio

- 11: unpack bunsen.cpio.gz ( success )
    Logs:
        - stdio: https://builder.sourceware.org/buildbot/#builders/39/builds/95/steps/11/logs/stdio

- 12: pass .bunsen.source.gitname ( success )
    Logs:
        - stdio: https://builder.sourceware.org/buildbot/#builders/39/builds/95/steps/12/logs/stdio

- 13: pass .bunsen.source.gitdescribe ( success )
    Logs:
        - stdio: https://builder.sourceware.org/buildbot/#builders/39/builds/95/steps/13/logs/stdio

- 14: pass .bunsen.source.gitbranch ( success )
    Logs:
        - stdio: https://builder.sourceware.org/buildbot/#builders/39/builds/95/steps/14/logs/stdio

- 15: pass .bunsen.source.gitrepo ( success )
    Logs:
        - stdio: https://builder.sourceware.org/buildbot/#builders/39/builds/95/steps/15/logs/stdio

- 16: upload to bunsen ( success )
    Logs:
        - stdio: https://builder.sourceware.org/buildbot/#builders/39/builds/95/steps/16/logs/stdio

- 17: clean up ( success )
    Logs:
        - stdio: https://builder.sourceware.org/buildbot/#builders/39/builds/95/steps/17/logs/stdio

- 18: make distclean ( success )
    Logs:
        - stdio: https://builder.sourceware.org/buildbot/#builders/39/builds/95/steps/18/logs/stdio

A restored build has been detected on builder elfutils-fedora-x86_64 while building elfutils.

Full details are available at:
    https://builder.sourceware.org/buildbot/#builders/59/builds/100

Build state: build successful
Revision: fb833750c395ce268d16fd44e4decafbb41208a8
Worker: bb1-2
Build Reason: (unknown)
Blamelist: Aaron Merey <amerey@redhat.com>, Yonggang Luo <luoyonggang@gmail.com>

Steps:

- 0: worker_preparation ( success )

- 1: set package name ( success )

- 2: git checkout ( success )
    Logs:
        - stdio: https://builder.sourceware.org/buildbot/#builders/59/builds/100/steps/2/logs/stdio

- 3: autoreconf ( success )
    Logs:
        - stdio: https://builder.sourceware.org/buildbot/#builders/59/builds/100/steps/3/logs/stdio

- 4: configure ( success )
    Logs:
        - stdio: https://builder.sourceware.org/buildbot/#builders/59/builds/100/steps/4/logs/stdio

- 5: get version ( success )
    Logs:
        - stdio: https://builder.sourceware.org/buildbot/#builders/59/builds/100/steps/5/logs/stdio
        - property changes: https://builder.sourceware.org/buildbot/#builders/59/builds/100/steps/5/logs/property_changes

- 6: make ( warnings )
    Logs:
        - stdio: https://builder.sourceware.org/buildbot/#builders/59/builds/100/steps/6/logs/stdio
        - warnings (3): https://builder.sourceware.org/buildbot/#builders/59/builds/100/steps/6/logs/warnings__3_

- 7: make check ( success )
    Logs:
        - stdio: https://builder.sourceware.org/buildbot/#builders/59/builds/100/steps/7/logs/stdio
        - test-suite.log: https://builder.sourceware.org/buildbot/#builders/59/builds/100/steps/7/logs/test-suite_log

- 8: make distcheck ( warnings )
    Logs:
        - stdio: https://builder.sourceware.org/buildbot/#builders/59/builds/100/steps/8/logs/stdio
        - test-suite.log: https://builder.sourceware.org/buildbot/#builders/59/builds/100/steps/8/logs/test-suite_log
        - warnings (8): https://builder.sourceware.org/buildbot/#builders/59/builds/100/steps/8/logs/warnings__8_

- 9: prep ( success )
    Logs:
        - stdio: https://builder.sourceware.org/buildbot/#builders/59/builds/100/steps/9/logs/stdio

- 10: build bunsen.cpio.gz ( success )
    Logs:
        - stdio: https://builder.sourceware.org/buildbot/#builders/59/builds/100/steps/10/logs/stdio

- 11: fetch bunsen.cpio.gz ( success )
    Logs:
        - stdio: https://builder.sourceware.org/buildbot/#builders/59/builds/100/steps/11/logs/stdio

- 12: unpack bunsen.cpio.gz ( success )
    Logs:
        - stdio: https://builder.sourceware.org/buildbot/#builders/59/builds/100/steps/12/logs/stdio

- 13: pass .bunsen.source.gitname ( success )
    Logs:
        - stdio: https://builder.sourceware.org/buildbot/#builders/59/builds/100/steps/13/logs/stdio

- 14: pass .bunsen.source.gitdescribe ( success )
    Logs:
        - stdio: https://builder.sourceware.org/buildbot/#builders/59/builds/100/steps/14/logs/stdio

- 15: pass .bunsen.source.gitbranch ( success )
    Logs:
        - stdio: https://builder.sourceware.org/buildbot/#builders/59/builds/100/steps/15/logs/stdio

- 16: pass .bunsen.source.gitrepo ( success )
    Logs:
        - stdio: https://builder.sourceware.org/buildbot/#builders/59/builds/100/steps/16/logs/stdio

- 17: upload to bunsen ( success )
    Logs:
        - stdio: https://builder.sourceware.org/buildbot/#builders/59/builds/100/steps/17/logs/stdio

- 18: clean up ( success )
    Logs:
        - stdio: https://builder.sourceware.org/buildbot/#builders/59/builds/100/steps/18/logs/stdio

- 19: make distclean ( success )
    Logs:
        - stdio: https://builder.sourceware.org/buildbot/#builders/59/builds/100/steps/19/logs/stdio


^ permalink raw reply	[flat|nested] 41+ messages in thread

* ☠ Buildbot (GNU Toolchain): elfutils - failed test (failure) (master)
@ 2022-10-31 13:51 builder
  0 siblings, 0 replies; 41+ messages in thread
From: builder @ 2022-10-31 13:51 UTC (permalink / raw)
  To: elfutils-devel

A new failure has been detected on builder elfutils-fedora-x86_64 while building elfutils.

Full details are available at:
    https://builder.sourceware.org/buildbot/#builders/59/builds/99

Build state: failed test (failure)
Revision: 5d8cd51a460fc29f35a016836c39fcea6bf59fb0
Worker: bb1-1
Build Reason: (unknown)
Blamelist: Yonggang Luo <luoyonggang@gmail.com>

Steps:

- 0: worker_preparation ( success )

- 1: set package name ( success )

- 2: git checkout ( success )
    Logs:
        - stdio: https://builder.sourceware.org/buildbot/#builders/59/builds/99/steps/2/logs/stdio

- 3: autoreconf ( success )
    Logs:
        - stdio: https://builder.sourceware.org/buildbot/#builders/59/builds/99/steps/3/logs/stdio

- 4: configure ( success )
    Logs:
        - stdio: https://builder.sourceware.org/buildbot/#builders/59/builds/99/steps/4/logs/stdio

- 5: get version ( success )
    Logs:
        - stdio: https://builder.sourceware.org/buildbot/#builders/59/builds/99/steps/5/logs/stdio
        - property changes: https://builder.sourceware.org/buildbot/#builders/59/builds/99/steps/5/logs/property_changes

- 6: make ( warnings )
    Logs:
        - stdio: https://builder.sourceware.org/buildbot/#builders/59/builds/99/steps/6/logs/stdio
        - warnings (3): https://builder.sourceware.org/buildbot/#builders/59/builds/99/steps/6/logs/warnings__3_

- 7: make check ( success )
    Logs:
        - stdio: https://builder.sourceware.org/buildbot/#builders/59/builds/99/steps/7/logs/stdio
        - test-suite.log: https://builder.sourceware.org/buildbot/#builders/59/builds/99/steps/7/logs/test-suite_log

- 8: make distcheck ( failure )
    Logs:
        - stdio: https://builder.sourceware.org/buildbot/#builders/59/builds/99/steps/8/logs/stdio
        - test-suite.log: https://builder.sourceware.org/buildbot/#builders/59/builds/99/steps/8/logs/test-suite_log
        - warnings (6): https://builder.sourceware.org/buildbot/#builders/59/builds/99/steps/8/logs/warnings__6_

- 9: prep ( success )
    Logs:
        - stdio: https://builder.sourceware.org/buildbot/#builders/59/builds/99/steps/9/logs/stdio

- 10: build bunsen.cpio.gz ( success )
    Logs:
        - stdio: https://builder.sourceware.org/buildbot/#builders/59/builds/99/steps/10/logs/stdio

- 11: fetch bunsen.cpio.gz ( success )
    Logs:
        - stdio: https://builder.sourceware.org/buildbot/#builders/59/builds/99/steps/11/logs/stdio

- 12: unpack bunsen.cpio.gz ( success )
    Logs:
        - stdio: https://builder.sourceware.org/buildbot/#builders/59/builds/99/steps/12/logs/stdio

- 13: pass .bunsen.source.gitname ( success )
    Logs:
        - stdio: https://builder.sourceware.org/buildbot/#builders/59/builds/99/steps/13/logs/stdio

- 14: pass .bunsen.source.gitdescribe ( success )
    Logs:
        - stdio: https://builder.sourceware.org/buildbot/#builders/59/builds/99/steps/14/logs/stdio

- 15: pass .bunsen.source.gitbranch ( success )
    Logs:
        - stdio: https://builder.sourceware.org/buildbot/#builders/59/builds/99/steps/15/logs/stdio

- 16: pass .bunsen.source.gitrepo ( success )
    Logs:
        - stdio: https://builder.sourceware.org/buildbot/#builders/59/builds/99/steps/16/logs/stdio

- 17: upload to bunsen ( success )
    Logs:
        - stdio: https://builder.sourceware.org/buildbot/#builders/59/builds/99/steps/17/logs/stdio

- 18: clean up ( success )
    Logs:
        - stdio: https://builder.sourceware.org/buildbot/#builders/59/builds/99/steps/18/logs/stdio

- 19: make distclean ( success )
    Logs:
        - stdio: https://builder.sourceware.org/buildbot/#builders/59/builds/99/steps/19/logs/stdio


^ permalink raw reply	[flat|nested] 41+ messages in thread

* ☠ Buildbot (GNU Toolchain): elfutils - failed test (failure) (master)
@ 2022-10-27 19:25 builder
  0 siblings, 0 replies; 41+ messages in thread
From: builder @ 2022-10-27 19:25 UTC (permalink / raw)
  To: elfutils-devel

A new failure has been detected on builder elfutils-debian-i386 while building elfutils.

Full details are available at:
    https://builder.sourceware.org/buildbot/#builders/17/builds/86

Build state: failed test (failure)
Revision: 73d016bde224af6d1be7c86fb2ea67af22f7582f
Worker: debian-i386-2
Build Reason: (unknown)
Blamelist: Mark Wielaard <mark@klomp.org>

Steps:

- 0: worker_preparation ( success )

- 1: set package name ( success )

- 2: git checkout ( success )
    Logs:
        - stdio: https://builder.sourceware.org/buildbot/#builders/17/builds/86/steps/2/logs/stdio

- 3: autoreconf ( success )
    Logs:
        - stdio: https://builder.sourceware.org/buildbot/#builders/17/builds/86/steps/3/logs/stdio

- 4: configure ( success )
    Logs:
        - stdio: https://builder.sourceware.org/buildbot/#builders/17/builds/86/steps/4/logs/stdio

- 5: get version ( success )
    Logs:
        - stdio: https://builder.sourceware.org/buildbot/#builders/17/builds/86/steps/5/logs/stdio
        - property changes: https://builder.sourceware.org/buildbot/#builders/17/builds/86/steps/5/logs/property_changes

- 6: make ( warnings )
    Logs:
        - stdio: https://builder.sourceware.org/buildbot/#builders/17/builds/86/steps/6/logs/stdio
        - warnings (3): https://builder.sourceware.org/buildbot/#builders/17/builds/86/steps/6/logs/warnings__3_

- 7: make check ( failure )
    Logs:
        - stdio: https://builder.sourceware.org/buildbot/#builders/17/builds/86/steps/7/logs/stdio
        - test-suite.log: https://builder.sourceware.org/buildbot/#builders/17/builds/86/steps/7/logs/test-suite_log

- 8: prep ( success )
    Logs:
        - stdio: https://builder.sourceware.org/buildbot/#builders/17/builds/86/steps/8/logs/stdio

- 9: build bunsen.cpio.gz ( success )
    Logs:
        - stdio: https://builder.sourceware.org/buildbot/#builders/17/builds/86/steps/9/logs/stdio

- 10: fetch bunsen.cpio.gz ( success )
    Logs:
        - stdio: https://builder.sourceware.org/buildbot/#builders/17/builds/86/steps/10/logs/stdio

- 11: unpack bunsen.cpio.gz ( success )
    Logs:
        - stdio: https://builder.sourceware.org/buildbot/#builders/17/builds/86/steps/11/logs/stdio

- 12: pass .bunsen.source.gitname ( success )
    Logs:
        - stdio: https://builder.sourceware.org/buildbot/#builders/17/builds/86/steps/12/logs/stdio

- 13: pass .bunsen.source.gitdescribe ( success )
    Logs:
        - stdio: https://builder.sourceware.org/buildbot/#builders/17/builds/86/steps/13/logs/stdio

- 14: pass .bunsen.source.gitbranch ( success )
    Logs:
        - stdio: https://builder.sourceware.org/buildbot/#builders/17/builds/86/steps/14/logs/stdio

- 15: pass .bunsen.source.gitrepo ( success )
    Logs:
        - stdio: https://builder.sourceware.org/buildbot/#builders/17/builds/86/steps/15/logs/stdio

- 16: upload to bunsen ( success )
    Logs:
        - stdio: https://builder.sourceware.org/buildbot/#builders/17/builds/86/steps/16/logs/stdio

- 17: clean up ( success )
    Logs:
        - stdio: https://builder.sourceware.org/buildbot/#builders/17/builds/86/steps/17/logs/stdio

- 18: make distclean ( success )
    Logs:
        - stdio: https://builder.sourceware.org/buildbot/#builders/17/builds/86/steps/18/logs/stdio


^ permalink raw reply	[flat|nested] 41+ messages in thread

* ☠ Buildbot (GNU Toolchain): elfutils - failed test (failure) (master)
@ 2022-10-17 14:59 builder
  0 siblings, 0 replies; 41+ messages in thread
From: builder @ 2022-10-17 14:59 UTC (permalink / raw)
  To: elfutils-devel

A new failure has been detected on builder elfutils-fedora-x86_64 while building elfutils.

Full details are available at:
    https://builder.sourceware.org/buildbot/#builders/59/builds/87

Build state: failed test (failure)
Revision: 4cc429d2761846967678fb8cf5868d311d1f7862
Worker: bb2-1
Build Reason: (unknown)
Blamelist: Frank Ch. Eigler <fche@redhat.com>

Steps:

- 0: worker_preparation ( success )

- 1: set package name ( success )

- 2: git checkout ( success )
    Logs:
        - stdio: https://builder.sourceware.org/buildbot/#builders/59/builds/87/steps/2/logs/stdio

- 3: autoreconf ( success )
    Logs:
        - stdio: https://builder.sourceware.org/buildbot/#builders/59/builds/87/steps/3/logs/stdio

- 4: configure ( success )
    Logs:
        - stdio: https://builder.sourceware.org/buildbot/#builders/59/builds/87/steps/4/logs/stdio

- 5: get version ( success )
    Logs:
        - stdio: https://builder.sourceware.org/buildbot/#builders/59/builds/87/steps/5/logs/stdio
        - property changes: https://builder.sourceware.org/buildbot/#builders/59/builds/87/steps/5/logs/property_changes

- 6: make ( warnings )
    Logs:
        - stdio: https://builder.sourceware.org/buildbot/#builders/59/builds/87/steps/6/logs/stdio
        - warnings (3): https://builder.sourceware.org/buildbot/#builders/59/builds/87/steps/6/logs/warnings__3_

- 7: make check ( success )
    Logs:
        - stdio: https://builder.sourceware.org/buildbot/#builders/59/builds/87/steps/7/logs/stdio
        - test-suite.log: https://builder.sourceware.org/buildbot/#builders/59/builds/87/steps/7/logs/test-suite_log

- 8: make distcheck ( failure )
    Logs:
        - stdio: https://builder.sourceware.org/buildbot/#builders/59/builds/87/steps/8/logs/stdio
        - test-suite.log: https://builder.sourceware.org/buildbot/#builders/59/builds/87/steps/8/logs/test-suite_log
        - warnings (5): https://builder.sourceware.org/buildbot/#builders/59/builds/87/steps/8/logs/warnings__5_

- 9: prep ( success )
    Logs:
        - stdio: https://builder.sourceware.org/buildbot/#builders/59/builds/87/steps/9/logs/stdio

- 10: build bunsen.cpio.gz ( success )
    Logs:
        - stdio: https://builder.sourceware.org/buildbot/#builders/59/builds/87/steps/10/logs/stdio

- 11: fetch bunsen.cpio.gz ( success )
    Logs:
        - stdio: https://builder.sourceware.org/buildbot/#builders/59/builds/87/steps/11/logs/stdio

- 12: unpack bunsen.cpio.gz ( success )
    Logs:
        - stdio: https://builder.sourceware.org/buildbot/#builders/59/builds/87/steps/12/logs/stdio

- 13: pass .bunsen.source.gitname ( success )
    Logs:
        - stdio: https://builder.sourceware.org/buildbot/#builders/59/builds/87/steps/13/logs/stdio

- 14: pass .bunsen.source.gitdescribe ( success )
    Logs:
        - stdio: https://builder.sourceware.org/buildbot/#builders/59/builds/87/steps/14/logs/stdio

- 15: pass .bunsen.source.gitbranch ( success )
    Logs:
        - stdio: https://builder.sourceware.org/buildbot/#builders/59/builds/87/steps/15/logs/stdio

- 16: pass .bunsen.source.gitrepo ( success )
    Logs:
        - stdio: https://builder.sourceware.org/buildbot/#builders/59/builds/87/steps/16/logs/stdio

- 17: upload to bunsen ( success )
    Logs:
        - stdio: https://builder.sourceware.org/buildbot/#builders/59/builds/87/steps/17/logs/stdio

- 18: clean up ( success )
    Logs:
        - stdio: https://builder.sourceware.org/buildbot/#builders/59/builds/87/steps/18/logs/stdio

- 19: make distclean ( success )
    Logs:
        - stdio: https://builder.sourceware.org/buildbot/#builders/59/builds/87/steps/19/logs/stdio

A restored build has been detected on builder elfutils-opensusetw-x86_64 while building elfutils.

Full details are available at:
    https://builder.sourceware.org/buildbot/#builders/88/builds/51

Build state: build successful
Revision: 4cc429d2761846967678fb8cf5868d311d1f7862
Worker: bb1-2
Build Reason: (unknown)
Blamelist: Frank Ch. Eigler <fche@redhat.com>, Yonggang Luo <luoyonggang@gmail.com>

Steps:

- 0: worker_preparation ( success )

- 1: set package name ( success )

- 2: git checkout ( success )
    Logs:
        - stdio: https://builder.sourceware.org/buildbot/#builders/88/builds/51/steps/2/logs/stdio

- 3: autoreconf ( success )
    Logs:
        - stdio: https://builder.sourceware.org/buildbot/#builders/88/builds/51/steps/3/logs/stdio

- 4: configure ( success )
    Logs:
        - stdio: https://builder.sourceware.org/buildbot/#builders/88/builds/51/steps/4/logs/stdio

- 5: get version ( success )
    Logs:
        - stdio: https://builder.sourceware.org/buildbot/#builders/88/builds/51/steps/5/logs/stdio
        - property changes: https://builder.sourceware.org/buildbot/#builders/88/builds/51/steps/5/logs/property_changes

- 6: make ( warnings )
    Logs:
        - stdio: https://builder.sourceware.org/buildbot/#builders/88/builds/51/steps/6/logs/stdio
        - warnings (3): https://builder.sourceware.org/buildbot/#builders/88/builds/51/steps/6/logs/warnings__3_

- 7: make check ( success )
    Logs:
        - stdio: https://builder.sourceware.org/buildbot/#builders/88/builds/51/steps/7/logs/stdio
        - test-suite.log: https://builder.sourceware.org/buildbot/#builders/88/builds/51/steps/7/logs/test-suite_log

- 8: make distcheck ( warnings )
    Logs:
        - stdio: https://builder.sourceware.org/buildbot/#builders/88/builds/51/steps/8/logs/stdio
        - test-suite.log: https://builder.sourceware.org/buildbot/#builders/88/builds/51/steps/8/logs/test-suite_log
        - warnings (5): https://builder.sourceware.org/buildbot/#builders/88/builds/51/steps/8/logs/warnings__5_

- 9: prep ( success )
    Logs:
        - stdio: https://builder.sourceware.org/buildbot/#builders/88/builds/51/steps/9/logs/stdio

- 10: build bunsen.cpio.gz ( success )
    Logs:
        - stdio: https://builder.sourceware.org/buildbot/#builders/88/builds/51/steps/10/logs/stdio

- 11: fetch bunsen.cpio.gz ( success )
    Logs:
        - stdio: https://builder.sourceware.org/buildbot/#builders/88/builds/51/steps/11/logs/stdio

- 12: unpack bunsen.cpio.gz ( success )
    Logs:
        - stdio: https://builder.sourceware.org/buildbot/#builders/88/builds/51/steps/12/logs/stdio

- 13: pass .bunsen.source.gitname ( success )
    Logs:
        - stdio: https://builder.sourceware.org/buildbot/#builders/88/builds/51/steps/13/logs/stdio

- 14: pass .bunsen.source.gitdescribe ( success )
    Logs:
        - stdio: https://builder.sourceware.org/buildbot/#builders/88/builds/51/steps/14/logs/stdio

- 15: pass .bunsen.source.gitbranch ( success )
    Logs:
        - stdio: https://builder.sourceware.org/buildbot/#builders/88/builds/51/steps/15/logs/stdio

- 16: pass .bunsen.source.gitrepo ( success )
    Logs:
        - stdio: https://builder.sourceware.org/buildbot/#builders/88/builds/51/steps/16/logs/stdio

- 17: upload to bunsen ( success )
    Logs:
        - stdio: https://builder.sourceware.org/buildbot/#builders/88/builds/51/steps/17/logs/stdio

- 18: clean up ( success )
    Logs:
        - stdio: https://builder.sourceware.org/buildbot/#builders/88/builds/51/steps/18/logs/stdio

- 19: make distclean ( success )
    Logs:
        - stdio: https://builder.sourceware.org/buildbot/#builders/88/builds/51/steps/19/logs/stdio


^ permalink raw reply	[flat|nested] 41+ messages in thread

* Re: ☠ Buildbot (GNU Toolchain): elfutils - failed test (failure) (master)
  2022-10-17 11:02   ` Frank Ch. Eigler
@ 2022-10-17 14:09     ` Frank Ch. Eigler
  0 siblings, 0 replies; 41+ messages in thread
From: Frank Ch. Eigler @ 2022-10-17 14:09 UTC (permalink / raw)
  To: Frank Ch. Eigler; +Cc: Mark Wielaard, Yonggang Luo, elfutils-devel

Hi -

> > Fatal error in GNU libmicrohttpd daemon.c:3831: Failed to remove FD
> > from epoll set.
> > Very odd. I don't have any hypothesis for why these are occuring.
> 
> I believe this is an intermittent libmicrohttpd bug. :-(

Pushing this patch as obvious ... and will try to track this one down
more urgently.


commit 4cc429d2761846967678fb8cf5868d311d1f7862 (HEAD -> master)
Author: Frank Ch. Eigler <fche@redhat.com>
Date:   Mon Oct 17 10:07:39 2022 -0400

    debuginfod: report libmicrohttpd version on startup
    
    To assist troubleshooting with intermittent bugs.
    
    Signed-off-by: Frank Ch. Eigler <fche@redhat.com>

diff --git a/debuginfod/ChangeLog b/debuginfod/ChangeLog
index 8fb65133f3e1..59d50df1fc8a 100644
--- a/debuginfod/ChangeLog
+++ b/debuginfod/ChangeLog
@@ -1,3 +1,7 @@
+2022-10-17  Frank Ch. Eigler  <fche@redhat.com>
+
+	* debuginfod.cxx (main): Report libmicrohttpd version.
+
 2022-09-28  Aaron Merey  <amerey@redhat.com>
 
 	* debuginfod-client.c (debuginfod_query_server): Switch sign of some
diff --git a/debuginfod/debuginfod.cxx b/debuginfod/debuginfod.cxx
index 8e7ee4997e0a..9dc4836bbe12 100644
--- a/debuginfod/debuginfod.cxx
+++ b/debuginfod/debuginfod.cxx
@@ -3956,6 +3956,8 @@ main (int argc, char *argv[])
         }
     }
 
+  obatched(clog) << "libmicrohttpd version " << MHD_get_version() << endl;
+  
   /* If '-C' wasn't given or was given with no arg, pick a reasonable default
      for the number of worker threads.  */
   if (connection_pool == 0)


^ permalink raw reply	[flat|nested] 41+ messages in thread

* Re: ☠ Buildbot (GNU Toolchain): elfutils - failed test (failure) (master)
  2022-10-17 10:26 ` Mark Wielaard
@ 2022-10-17 11:02   ` Frank Ch. Eigler
  2022-10-17 14:09     ` Frank Ch. Eigler
  0 siblings, 1 reply; 41+ messages in thread
From: Frank Ch. Eigler @ 2022-10-17 11:02 UTC (permalink / raw)
  To: Mark Wielaard; +Cc: Yonggang Luo, elfutils-devel

Hi -

> Fatal error in GNU libmicrohttpd daemon.c:3831: Failed to remove FD
> from epoll set.
> Very odd. I don't have any hypothesis for why these are occuring.

I believe this is an intermittent libmicrohttpd bug. :-(

- FChE


^ permalink raw reply	[flat|nested] 41+ messages in thread

* Re: ☠ Buildbot (GNU Toolchain): elfutils - failed test (failure) (master)
  2022-10-17  9:08 builder
@ 2022-10-17 10:26 ` Mark Wielaard
  2022-10-17 11:02   ` Frank Ch. Eigler
  0 siblings, 1 reply; 41+ messages in thread
From: Mark Wielaard @ 2022-10-17 10:26 UTC (permalink / raw)
  To: Yonggang Luo, elfutils-devel

Hi,

On Mon, 2022-10-17 at 09:08 +0000, builder--- via Elfutils-devel wrote:
> A new failure has been detected on builder elfutils-opensusetw-x86_64 
> while building elfutils.
> 
> Full details are available at:
>     https://builder.sourceware.org/buildbot/#builders/88/builds/50
> 
> Build state: failed test (failure)
> Revision: 0e18267a05247b5bda60115270203b4ad3af8e55
> Worker: bb2-1
> Build Reason: (unknown)
> Blamelist: Yonggang Luo <luoyonggang@gmail.com>

This is clearly not caused by that last commit.

Sadly run-debuginfod-federation-metrics.sh seem somewhat fragile, but
it isn't immediately clear why. It sometimes seems to crash in a bash
wait? Or does this say, we were waiting, on a process that crashed?

/home/builder/shared/bb2-1/worker/elfutils-opensusetw-
x86_64/build/tests/run-debuginfod-federation-metrics.sh: line 205:
26486 Aborted                 (core dumped) env LD_LIBRARY_PATH=$ldpath
${abs_builddir}/../debuginfod/debuginfod $VERBOSE -d ${DB} -F -U -t0
-g0 -p $PORT1 L D F > vlog$PORT1 2>&1

The log also says:

Fatal error in GNU libmicrohttpd daemon.c:3831: Failed to remove FD
from epoll set.

Very odd. I don't have any hypothesis for why these are occuring.

Cheers,

Mark

^ permalink raw reply	[flat|nested] 41+ messages in thread

* ☠ Buildbot (GNU Toolchain): elfutils - failed test (failure) (master)
@ 2022-10-17  9:08 builder
  2022-10-17 10:26 ` Mark Wielaard
  0 siblings, 1 reply; 41+ messages in thread
From: builder @ 2022-10-17  9:08 UTC (permalink / raw)
  To: elfutils-devel

A new failure has been detected on builder elfutils-opensusetw-x86_64 while building elfutils.

Full details are available at:
    https://builder.sourceware.org/buildbot/#builders/88/builds/50

Build state: failed test (failure)
Revision: 0e18267a05247b5bda60115270203b4ad3af8e55
Worker: bb2-1
Build Reason: (unknown)
Blamelist: Yonggang Luo <luoyonggang@gmail.com>

Steps:

- 0: worker_preparation ( success )

- 1: set package name ( success )

- 2: git checkout ( success )
    Logs:
        - stdio: https://builder.sourceware.org/buildbot/#builders/88/builds/50/steps/2/logs/stdio

- 3: autoreconf ( success )
    Logs:
        - stdio: https://builder.sourceware.org/buildbot/#builders/88/builds/50/steps/3/logs/stdio

- 4: configure ( success )
    Logs:
        - stdio: https://builder.sourceware.org/buildbot/#builders/88/builds/50/steps/4/logs/stdio

- 5: get version ( success )
    Logs:
        - stdio: https://builder.sourceware.org/buildbot/#builders/88/builds/50/steps/5/logs/stdio
        - property changes: https://builder.sourceware.org/buildbot/#builders/88/builds/50/steps/5/logs/property_changes

- 6: make ( warnings )
    Logs:
        - stdio: https://builder.sourceware.org/buildbot/#builders/88/builds/50/steps/6/logs/stdio
        - warnings (3): https://builder.sourceware.org/buildbot/#builders/88/builds/50/steps/6/logs/warnings__3_

- 7: make check ( failure )
    Logs:
        - stdio: https://builder.sourceware.org/buildbot/#builders/88/builds/50/steps/7/logs/stdio
        - test-suite.log: https://builder.sourceware.org/buildbot/#builders/88/builds/50/steps/7/logs/test-suite_log

- 8: make distcheck ( warnings )
    Logs:
        - stdio: https://builder.sourceware.org/buildbot/#builders/88/builds/50/steps/8/logs/stdio
        - test-suite.log: https://builder.sourceware.org/buildbot/#builders/88/builds/50/steps/8/logs/test-suite_log
        - warnings (5): https://builder.sourceware.org/buildbot/#builders/88/builds/50/steps/8/logs/warnings__5_

- 9: prep ( success )
    Logs:
        - stdio: https://builder.sourceware.org/buildbot/#builders/88/builds/50/steps/9/logs/stdio

- 10: build bunsen.cpio.gz ( success )
    Logs:
        - stdio: https://builder.sourceware.org/buildbot/#builders/88/builds/50/steps/10/logs/stdio

- 11: fetch bunsen.cpio.gz ( success )
    Logs:
        - stdio: https://builder.sourceware.org/buildbot/#builders/88/builds/50/steps/11/logs/stdio

- 12: unpack bunsen.cpio.gz ( success )
    Logs:
        - stdio: https://builder.sourceware.org/buildbot/#builders/88/builds/50/steps/12/logs/stdio

- 13: pass .bunsen.source.gitname ( success )
    Logs:
        - stdio: https://builder.sourceware.org/buildbot/#builders/88/builds/50/steps/13/logs/stdio

- 14: pass .bunsen.source.gitdescribe ( success )
    Logs:
        - stdio: https://builder.sourceware.org/buildbot/#builders/88/builds/50/steps/14/logs/stdio

- 15: pass .bunsen.source.gitbranch ( success )
    Logs:
        - stdio: https://builder.sourceware.org/buildbot/#builders/88/builds/50/steps/15/logs/stdio

- 16: pass .bunsen.source.gitrepo ( success )
    Logs:
        - stdio: https://builder.sourceware.org/buildbot/#builders/88/builds/50/steps/16/logs/stdio

- 17: upload to bunsen ( success )
    Logs:
        - stdio: https://builder.sourceware.org/buildbot/#builders/88/builds/50/steps/17/logs/stdio

- 18: clean up ( success )
    Logs:
        - stdio: https://builder.sourceware.org/buildbot/#builders/88/builds/50/steps/18/logs/stdio

- 19: make distclean ( success )
    Logs:
        - stdio: https://builder.sourceware.org/buildbot/#builders/88/builds/50/steps/19/logs/stdio


^ permalink raw reply	[flat|nested] 41+ messages in thread

* ☠ Buildbot (GNU Toolchain): elfutils - failed test (failure) (master)
@ 2022-10-16 21:02 builder
  0 siblings, 0 replies; 41+ messages in thread
From: builder @ 2022-10-16 21:02 UTC (permalink / raw)
  To: elfutils-devel

A new failure has been detected on builder elfutils-fedora-s390x while building elfutils.

Full details are available at:
    https://builder.sourceware.org/buildbot/#builders/43/builds/78

Build state: failed test (failure)
Revision: a6b2ec76d51386dd06ab86d46eabbcf5140fe80d
Worker: fedora-s390x
Build Reason: (unknown)
Blamelist: Yonggang Luo <luoyonggang@gmail.com>

Steps:

- 0: worker_preparation ( success )

- 1: set package name ( success )

- 2: git checkout ( success )
    Logs:
        - stdio: https://builder.sourceware.org/buildbot/#builders/43/builds/78/steps/2/logs/stdio

- 3: autoreconf ( success )
    Logs:
        - stdio: https://builder.sourceware.org/buildbot/#builders/43/builds/78/steps/3/logs/stdio

- 4: configure ( success )
    Logs:
        - stdio: https://builder.sourceware.org/buildbot/#builders/43/builds/78/steps/4/logs/stdio

- 5: get version ( success )
    Logs:
        - stdio: https://builder.sourceware.org/buildbot/#builders/43/builds/78/steps/5/logs/stdio
        - property changes: https://builder.sourceware.org/buildbot/#builders/43/builds/78/steps/5/logs/property_changes

- 6: make ( warnings )
    Logs:
        - stdio: https://builder.sourceware.org/buildbot/#builders/43/builds/78/steps/6/logs/stdio
        - warnings (3): https://builder.sourceware.org/buildbot/#builders/43/builds/78/steps/6/logs/warnings__3_

- 7: make check ( failure )
    Logs:
        - stdio: https://builder.sourceware.org/buildbot/#builders/43/builds/78/steps/7/logs/stdio
        - test-suite.log: https://builder.sourceware.org/buildbot/#builders/43/builds/78/steps/7/logs/test-suite_log

- 8: prep ( success )
    Logs:
        - stdio: https://builder.sourceware.org/buildbot/#builders/43/builds/78/steps/8/logs/stdio

- 9: build bunsen.cpio.gz ( success )
    Logs:
        - stdio: https://builder.sourceware.org/buildbot/#builders/43/builds/78/steps/9/logs/stdio

- 10: fetch bunsen.cpio.gz ( success )
    Logs:
        - stdio: https://builder.sourceware.org/buildbot/#builders/43/builds/78/steps/10/logs/stdio

- 11: unpack bunsen.cpio.gz ( success )
    Logs:
        - stdio: https://builder.sourceware.org/buildbot/#builders/43/builds/78/steps/11/logs/stdio

- 12: pass .bunsen.source.gitname ( success )
    Logs:
        - stdio: https://builder.sourceware.org/buildbot/#builders/43/builds/78/steps/12/logs/stdio

- 13: pass .bunsen.source.gitdescribe ( success )
    Logs:
        - stdio: https://builder.sourceware.org/buildbot/#builders/43/builds/78/steps/13/logs/stdio

- 14: pass .bunsen.source.gitbranch ( success )
    Logs:
        - stdio: https://builder.sourceware.org/buildbot/#builders/43/builds/78/steps/14/logs/stdio

- 15: pass .bunsen.source.gitrepo ( success )
    Logs:
        - stdio: https://builder.sourceware.org/buildbot/#builders/43/builds/78/steps/15/logs/stdio

- 16: upload to bunsen ( success )
    Logs:
        - stdio: https://builder.sourceware.org/buildbot/#builders/43/builds/78/steps/16/logs/stdio

- 17: clean up ( success )
    Logs:
        - stdio: https://builder.sourceware.org/buildbot/#builders/43/builds/78/steps/17/logs/stdio

- 18: make distclean ( success )
    Logs:
        - stdio: https://builder.sourceware.org/buildbot/#builders/43/builds/78/steps/18/logs/stdio


^ permalink raw reply	[flat|nested] 41+ messages in thread

* Re: ☠ Buildbot (GNU Toolchain): elfutils - failed test (failure) (master)
  2022-10-16 15:47 builder
@ 2022-10-16 16:26 ` Mark Wielaard
  0 siblings, 0 replies; 41+ messages in thread
From: Mark Wielaard @ 2022-10-16 16:26 UTC (permalink / raw)
  To: Aleksei Vetrov; +Cc: elfutils-devel

[-- Attachment #1: Type: text/plain, Size: 1461 bytes --]

There is a run-debuginfod-federation-metrics.sh failure that must be
unrelated. It is an odd crash in the shell script wait statement?

But there are also a few failures compiling the new testcase:

In file included from /usr/include/features.h:490,
                 from /usr/include/assert.h:35,
                 from dwfl-report-offline-memory.c:18:
In function ‘read’,
    inlined from ‘main’ at dwfl-report-offline-memory.c:68:23:
/usr/include/bits/unistd.h:38:10: error: ‘__read_alias’ specified size 18446744073709551615 exceeds maximum object size 9223372036854775807 [-Werror=stringop-overflow=]
   38 |   return __glibc_fortify (read, __nbytes, sizeof (char),
      |          ^~~~~~~~~~~~~~~
/usr/include/bits/unistd.h: In function ‘main’:
/usr/include/bits/unistd.h:26:16: note: in a call to function ‘__read_alias’ declared with attribute ‘access (write_only, 2, 3)’
   26 | extern ssize_t __REDIRECT (__read_alias, (int __fd, void *__buf,
      |                ^~~~~~~~~~
cc1: all warnings being treated as errors
make[2]: *** [Makefile:2461: dwfl-report-offline-memory.o] Error 1

This seems technically correct since we use the wrong types size_t vs
off_t and ssize_t and don't check the results from lseek, read and
malloc.

Patch to fix that attached.

And there is an error on 32bit systems:
tests/dwfl-report-offline-memory contains non-lfs symbols: lseek open

Fix that by including config.h earlier.

Cheers,

Mark

[-- Attachment #2: 0001-tests-Check-lseek-read-and-malloc-results-with-corre.patch --]
[-- Type: text/x-diff, Size: 2879 bytes --]

From 72860bfdca5286399837080d53ba297bf72c56b3 Mon Sep 17 00:00:00 2001
From: Mark Wielaard <mark@klomp.org>
Date: Sun, 16 Oct 2022 18:02:46 +0200
Subject: [PATCH] tests: Check lseek, read and malloc results with correct
 types in test.
MIME-Version: 1.0
Content-Type: text/plain; charset=UTF-8
Content-Transfer-Encoding: 8bit

When compiling dwfl-report-offline-memory.c on some systems (latest
gcc/glibc and --enable-sanitize-undefined) we might get:

In file included from /usr/include/features.h:490,
                 from /usr/include/assert.h:35,
                 from dwfl-report-offline-memory.c:18:
In function ‘read’,
    inlined from ‘main’ at dwfl-report-offline-memory.c:68:23:
/usr/include/bits/unistd.h:38:10: error: ‘__read_alias’ specified size 18446744073709551615
  exceeds maximum object size 9223372036854775807 [-Werror=stringop-overflow=]
   38 |   return __glibc_fortify (read, __nbytes, sizeof (char),
      |          ^~~~~~~~~~~~~~~
/usr/include/bits/unistd.h: In function ‘main’:
/usr/include/bits/unistd.h:26:16: note: in a call to function ‘__read_alias’ declared with
  attribute ‘access (write_only, 2, 3)’
   26 | extern ssize_t __REDIRECT (__read_alias, (int __fd, void *__buf,
      |                ^~~~~~~~~~
cc1: all warnings being treated as errors
make[2]: *** [Makefile:2461: dwfl-report-offline-memory.o] Error 1

Fix by using the correct types and checking all return values.

Signed-off-by: Mark Wielaard <mark@klomp.org>
---
 tests/ChangeLog                    | 5 +++++
 tests/dwfl-report-offline-memory.c | 8 ++++++--
 2 files changed, 11 insertions(+), 2 deletions(-)

diff --git a/tests/ChangeLog b/tests/ChangeLog
index 6ac2c1e8..d07a910e 100644
--- a/tests/ChangeLog
+++ b/tests/ChangeLog
@@ -1,3 +1,8 @@
+2022-10-16  Mark Wielaard  <mark@klomp.org>
+
+	* dwfl-report-offline-memory.c (main): Check lseek, read and malloc
+	results with correct types.
+
 2022-09-13  Aleksei Vetrov  <vvvvvv@google.com>
 
 	* Makefile.am (check_PROGRAMS): Add dwfl-report-offline-memory.
diff --git a/tests/dwfl-report-offline-memory.c b/tests/dwfl-report-offline-memory.c
index 837aca5e..81fa136f 100644
--- a/tests/dwfl-report-offline-memory.c
+++ b/tests/dwfl-report-offline-memory.c
@@ -62,10 +62,14 @@ main (int argc, char **argv)
   int fd = open (fname, O_RDONLY);
   if (fd < 0)
     error (-1, 0, "can't open file %s: %s", fname, strerror (errno));
-  size_t size = lseek (fd, 0, SEEK_END);
+  off_t size = lseek (fd, 0, SEEK_END);
+  if (size < 0)
+    error (-1, 0, "can't lseek file %s: %s", fname, strerror (errno));
   lseek (fd, 0, SEEK_SET);
   char *data = malloc (size);
-  size_t bytes_read = read (fd, data, size);
+  if (data == NULL)
+    error (-1, 0, "can't malloc: %s", strerror (errno));
+  ssize_t bytes_read = read (fd, data, size);
   assert (bytes_read == size);
   close (fd);
 
-- 
2.30.2


[-- Attachment #3: 0001-tests-include-config.h-first.patch --]
[-- Type: text/x-diff, Size: 1376 bytes --]

From 2a4ce08fafcf76d866ae5f6b394389d8d93aa0cb Mon Sep 17 00:00:00 2001
From: Mark Wielaard <mark@klomp.org>
Date: Sun, 16 Oct 2022 18:23:06 +0200
Subject: [PATCH] tests: include config.h first.

Otherwise some symbols (lseek, open) might not get the 64bit offset
variants because they don't pick up _FILE_OFFSET_BITS.

Signed-off-by: Mark Wielaard <mark@klomp.org>
---
 tests/ChangeLog                    | 4 ++++
 tests/dwfl-report-offline-memory.c | 3 ++-
 2 files changed, 6 insertions(+), 1 deletion(-)

diff --git a/tests/ChangeLog b/tests/ChangeLog
index d07a910e..0ea1df3d 100644
--- a/tests/ChangeLog
+++ b/tests/ChangeLog
@@ -1,3 +1,7 @@
+2022-10-16  Mark Wielaard  <mark@klomp.org>
+
+	* dwfl-report-offline-memory.c: Include config.h first.
+
 2022-10-16  Mark Wielaard  <mark@klomp.org>
 
 	* dwfl-report-offline-memory.c (main): Check lseek, read and malloc
diff --git a/tests/dwfl-report-offline-memory.c b/tests/dwfl-report-offline-memory.c
index 81fa136f..e6cb0a51 100644
--- a/tests/dwfl-report-offline-memory.c
+++ b/tests/dwfl-report-offline-memory.c
@@ -15,8 +15,9 @@
    You should have received a copy of the GNU General Public License
    along with this program.  If not, see <http://www.gnu.org/licenses/>.  */
 
-#include <assert.h>
 #include <config.h>
+
+#include <assert.h>
 #include <fcntl.h>
 #include <locale.h>
 #include <stdio.h>
-- 
2.30.2


^ permalink raw reply	[flat|nested] 41+ messages in thread

* ☠ Buildbot (GNU Toolchain): elfutils - failed test (failure) (master)
@ 2022-10-16 15:47 builder
  2022-10-16 16:26 ` Mark Wielaard
  0 siblings, 1 reply; 41+ messages in thread
From: builder @ 2022-10-16 15:47 UTC (permalink / raw)
  To: elfutils-devel

A new failure has been detected on builder elfutils-debian-arm64 while building elfutils.

Full details are available at:
    https://builder.sourceware.org/buildbot/#builders/5/builds/74

Build state: failed test (failure)
Revision: 64ee2cb792e7b6ba6ad2a5759bff7ce8714e4668
Worker: debian-arm64
Build Reason: (unknown)
Blamelist: Aleksei Vetrov <vvvvvv@google.com>

Steps:

- 0: worker_preparation ( success )

- 1: set package name ( success )

- 2: git checkout ( success )
    Logs:
        - stdio: https://builder.sourceware.org/buildbot/#builders/5/builds/74/steps/2/logs/stdio

- 3: autoreconf ( success )
    Logs:
        - stdio: https://builder.sourceware.org/buildbot/#builders/5/builds/74/steps/3/logs/stdio

- 4: configure ( success )
    Logs:
        - stdio: https://builder.sourceware.org/buildbot/#builders/5/builds/74/steps/4/logs/stdio

- 5: get version ( success )
    Logs:
        - stdio: https://builder.sourceware.org/buildbot/#builders/5/builds/74/steps/5/logs/stdio
        - property changes: https://builder.sourceware.org/buildbot/#builders/5/builds/74/steps/5/logs/property_changes

- 6: make ( warnings )
    Logs:
        - stdio: https://builder.sourceware.org/buildbot/#builders/5/builds/74/steps/6/logs/stdio
        - warnings (3): https://builder.sourceware.org/buildbot/#builders/5/builds/74/steps/6/logs/warnings__3_

- 7: make check ( failure )
    Logs:
        - stdio: https://builder.sourceware.org/buildbot/#builders/5/builds/74/steps/7/logs/stdio
        - test-suite.log: https://builder.sourceware.org/buildbot/#builders/5/builds/74/steps/7/logs/test-suite_log

- 8: prep ( success )
    Logs:
        - stdio: https://builder.sourceware.org/buildbot/#builders/5/builds/74/steps/8/logs/stdio

- 9: build bunsen.cpio.gz ( success )
    Logs:
        - stdio: https://builder.sourceware.org/buildbot/#builders/5/builds/74/steps/9/logs/stdio

- 10: fetch bunsen.cpio.gz ( success )
    Logs:
        - stdio: https://builder.sourceware.org/buildbot/#builders/5/builds/74/steps/10/logs/stdio

- 11: unpack bunsen.cpio.gz ( success )
    Logs:
        - stdio: https://builder.sourceware.org/buildbot/#builders/5/builds/74/steps/11/logs/stdio

- 12: pass .bunsen.source.gitname ( success )
    Logs:
        - stdio: https://builder.sourceware.org/buildbot/#builders/5/builds/74/steps/12/logs/stdio

- 13: pass .bunsen.source.gitdescribe ( success )
    Logs:
        - stdio: https://builder.sourceware.org/buildbot/#builders/5/builds/74/steps/13/logs/stdio

- 14: pass .bunsen.source.gitbranch ( success )
    Logs:
        - stdio: https://builder.sourceware.org/buildbot/#builders/5/builds/74/steps/14/logs/stdio

- 15: pass .bunsen.source.gitrepo ( success )
    Logs:
        - stdio: https://builder.sourceware.org/buildbot/#builders/5/builds/74/steps/15/logs/stdio

- 16: upload to bunsen ( success )
    Logs:
        - stdio: https://builder.sourceware.org/buildbot/#builders/5/builds/74/steps/16/logs/stdio

- 17: clean up ( success )
    Logs:
        - stdio: https://builder.sourceware.org/buildbot/#builders/5/builds/74/steps/17/logs/stdio

- 18: make distclean ( success )
    Logs:
        - stdio: https://builder.sourceware.org/buildbot/#builders/5/builds/74/steps/18/logs/stdio

A new failure has been detected on builder elfutils-debian-armhf while building elfutils.

Full details are available at:
    https://builder.sourceware.org/buildbot/#builders/6/builds/75

Build state: failed test (failure)
Revision: 64ee2cb792e7b6ba6ad2a5759bff7ce8714e4668
Worker: debian-armhf
Build Reason: (unknown)
Blamelist: Aleksei Vetrov <vvvvvv@google.com>

Steps:

- 0: worker_preparation ( success )

- 1: set package name ( success )

- 2: git checkout ( success )
    Logs:
        - stdio: https://builder.sourceware.org/buildbot/#builders/6/builds/75/steps/2/logs/stdio

- 3: autoreconf ( success )
    Logs:
        - stdio: https://builder.sourceware.org/buildbot/#builders/6/builds/75/steps/3/logs/stdio

- 4: configure ( success )
    Logs:
        - stdio: https://builder.sourceware.org/buildbot/#builders/6/builds/75/steps/4/logs/stdio

- 5: get version ( success )
    Logs:
        - stdio: https://builder.sourceware.org/buildbot/#builders/6/builds/75/steps/5/logs/stdio
        - property changes: https://builder.sourceware.org/buildbot/#builders/6/builds/75/steps/5/logs/property_changes

- 6: make ( warnings )
    Logs:
        - stdio: https://builder.sourceware.org/buildbot/#builders/6/builds/75/steps/6/logs/stdio
        - warnings (3): https://builder.sourceware.org/buildbot/#builders/6/builds/75/steps/6/logs/warnings__3_

- 7: make check ( failure )
    Logs:
        - stdio: https://builder.sourceware.org/buildbot/#builders/6/builds/75/steps/7/logs/stdio
        - test-suite.log: https://builder.sourceware.org/buildbot/#builders/6/builds/75/steps/7/logs/test-suite_log

- 8: prep ( success )
    Logs:
        - stdio: https://builder.sourceware.org/buildbot/#builders/6/builds/75/steps/8/logs/stdio

- 9: build bunsen.cpio.gz ( success )
    Logs:
        - stdio: https://builder.sourceware.org/buildbot/#builders/6/builds/75/steps/9/logs/stdio

- 10: fetch bunsen.cpio.gz ( success )
    Logs:
        - stdio: https://builder.sourceware.org/buildbot/#builders/6/builds/75/steps/10/logs/stdio

- 11: unpack bunsen.cpio.gz ( success )
    Logs:
        - stdio: https://builder.sourceware.org/buildbot/#builders/6/builds/75/steps/11/logs/stdio

- 12: pass .bunsen.source.gitname ( success )
    Logs:
        - stdio: https://builder.sourceware.org/buildbot/#builders/6/builds/75/steps/12/logs/stdio

- 13: pass .bunsen.source.gitdescribe ( success )
    Logs:
        - stdio: https://builder.sourceware.org/buildbot/#builders/6/builds/75/steps/13/logs/stdio

- 14: pass .bunsen.source.gitbranch ( success )
    Logs:
        - stdio: https://builder.sourceware.org/buildbot/#builders/6/builds/75/steps/14/logs/stdio

- 15: pass .bunsen.source.gitrepo ( success )
    Logs:
        - stdio: https://builder.sourceware.org/buildbot/#builders/6/builds/75/steps/15/logs/stdio

- 16: upload to bunsen ( success )
    Logs:
        - stdio: https://builder.sourceware.org/buildbot/#builders/6/builds/75/steps/16/logs/stdio

- 17: clean up ( success )
    Logs:
        - stdio: https://builder.sourceware.org/buildbot/#builders/6/builds/75/steps/17/logs/stdio

- 18: make distclean ( success )
    Logs:
        - stdio: https://builder.sourceware.org/buildbot/#builders/6/builds/75/steps/18/logs/stdio

A restored build has been detected on builder elfutils-centos-x86_64 while building elfutils.

Full details are available at:
    https://builder.sourceware.org/buildbot/#builders/39/builds/76

Build state: build successful
Revision: 64ee2cb792e7b6ba6ad2a5759bff7ce8714e4668
Worker: centos-x86_64
Build Reason: (unknown)
Blamelist: Aleksei Vetrov <vvvvvv@google.com>, Khem Raj <raj.khem@gmail.com>

Steps:

- 0: worker_preparation ( success )

- 1: set package name ( success )

- 2: git checkout ( success )
    Logs:
        - stdio: https://builder.sourceware.org/buildbot/#builders/39/builds/76/steps/2/logs/stdio

- 3: autoreconf ( success )
    Logs:
        - stdio: https://builder.sourceware.org/buildbot/#builders/39/builds/76/steps/3/logs/stdio

- 4: configure ( success )
    Logs:
        - stdio: https://builder.sourceware.org/buildbot/#builders/39/builds/76/steps/4/logs/stdio

- 5: get version ( success )
    Logs:
        - stdio: https://builder.sourceware.org/buildbot/#builders/39/builds/76/steps/5/logs/stdio
        - property changes: https://builder.sourceware.org/buildbot/#builders/39/builds/76/steps/5/logs/property_changes

- 6: make ( warnings )
    Logs:
        - stdio: https://builder.sourceware.org/buildbot/#builders/39/builds/76/steps/6/logs/stdio
        - warnings (2): https://builder.sourceware.org/buildbot/#builders/39/builds/76/steps/6/logs/warnings__2_

- 7: make check ( success )
    Logs:
        - stdio: https://builder.sourceware.org/buildbot/#builders/39/builds/76/steps/7/logs/stdio
        - test-suite.log: https://builder.sourceware.org/buildbot/#builders/39/builds/76/steps/7/logs/test-suite_log

- 8: prep ( success )
    Logs:
        - stdio: https://builder.sourceware.org/buildbot/#builders/39/builds/76/steps/8/logs/stdio

- 9: build bunsen.cpio.gz ( success )
    Logs:
        - stdio: https://builder.sourceware.org/buildbot/#builders/39/builds/76/steps/9/logs/stdio

- 10: fetch bunsen.cpio.gz ( success )
    Logs:
        - stdio: https://builder.sourceware.org/buildbot/#builders/39/builds/76/steps/10/logs/stdio

- 11: unpack bunsen.cpio.gz ( success )
    Logs:
        - stdio: https://builder.sourceware.org/buildbot/#builders/39/builds/76/steps/11/logs/stdio

- 12: pass .bunsen.source.gitname ( success )
    Logs:
        - stdio: https://builder.sourceware.org/buildbot/#builders/39/builds/76/steps/12/logs/stdio

- 13: pass .bunsen.source.gitdescribe ( success )
    Logs:
        - stdio: https://builder.sourceware.org/buildbot/#builders/39/builds/76/steps/13/logs/stdio

- 14: pass .bunsen.source.gitbranch ( success )
    Logs:
        - stdio: https://builder.sourceware.org/buildbot/#builders/39/builds/76/steps/14/logs/stdio

- 15: pass .bunsen.source.gitrepo ( success )
    Logs:
        - stdio: https://builder.sourceware.org/buildbot/#builders/39/builds/76/steps/15/logs/stdio

- 16: upload to bunsen ( success )
    Logs:
        - stdio: https://builder.sourceware.org/buildbot/#builders/39/builds/76/steps/16/logs/stdio

- 17: clean up ( success )
    Logs:
        - stdio: https://builder.sourceware.org/buildbot/#builders/39/builds/76/steps/17/logs/stdio

- 18: make distclean ( success )
    Logs:
        - stdio: https://builder.sourceware.org/buildbot/#builders/39/builds/76/steps/18/logs/stdio

A new failure has been detected on builder elfutils-fedora-s390x while building elfutils.

Full details are available at:
    https://builder.sourceware.org/buildbot/#builders/43/builds/75

Build state: failed test (failure)
Revision: 64ee2cb792e7b6ba6ad2a5759bff7ce8714e4668
Worker: fedora-s390x
Build Reason: (unknown)
Blamelist: Aleksei Vetrov <vvvvvv@google.com>

Steps:

- 0: worker_preparation ( success )

- 1: set package name ( success )

- 2: git checkout ( success )
    Logs:
        - stdio: https://builder.sourceware.org/buildbot/#builders/43/builds/75/steps/2/logs/stdio

- 3: autoreconf ( success )
    Logs:
        - stdio: https://builder.sourceware.org/buildbot/#builders/43/builds/75/steps/3/logs/stdio

- 4: configure ( success )
    Logs:
        - stdio: https://builder.sourceware.org/buildbot/#builders/43/builds/75/steps/4/logs/stdio

- 5: get version ( success )
    Logs:
        - stdio: https://builder.sourceware.org/buildbot/#builders/43/builds/75/steps/5/logs/stdio
        - property changes: https://builder.sourceware.org/buildbot/#builders/43/builds/75/steps/5/logs/property_changes

- 6: make ( warnings )
    Logs:
        - stdio: https://builder.sourceware.org/buildbot/#builders/43/builds/75/steps/6/logs/stdio
        - warnings (3): https://builder.sourceware.org/buildbot/#builders/43/builds/75/steps/6/logs/warnings__3_

- 7: make check ( failure )
    Logs:
        - stdio: https://builder.sourceware.org/buildbot/#builders/43/builds/75/steps/7/logs/stdio
        - test-suite.log: https://builder.sourceware.org/buildbot/#builders/43/builds/75/steps/7/logs/test-suite_log

- 8: prep ( success )
    Logs:
        - stdio: https://builder.sourceware.org/buildbot/#builders/43/builds/75/steps/8/logs/stdio

- 9: build bunsen.cpio.gz ( success )
    Logs:
        - stdio: https://builder.sourceware.org/buildbot/#builders/43/builds/75/steps/9/logs/stdio

- 10: fetch bunsen.cpio.gz ( success )
    Logs:
        - stdio: https://builder.sourceware.org/buildbot/#builders/43/builds/75/steps/10/logs/stdio

- 11: unpack bunsen.cpio.gz ( success )
    Logs:
        - stdio: https://builder.sourceware.org/buildbot/#builders/43/builds/75/steps/11/logs/stdio

- 12: pass .bunsen.source.gitname ( success )
    Logs:
        - stdio: https://builder.sourceware.org/buildbot/#builders/43/builds/75/steps/12/logs/stdio

- 13: pass .bunsen.source.gitdescribe ( success )
    Logs:
        - stdio: https://builder.sourceware.org/buildbot/#builders/43/builds/75/steps/13/logs/stdio

- 14: pass .bunsen.source.gitbranch ( success )
    Logs:
        - stdio: https://builder.sourceware.org/buildbot/#builders/43/builds/75/steps/14/logs/stdio

- 15: pass .bunsen.source.gitrepo ( success )
    Logs:
        - stdio: https://builder.sourceware.org/buildbot/#builders/43/builds/75/steps/15/logs/stdio

- 16: upload to bunsen ( success )
    Logs:
        - stdio: https://builder.sourceware.org/buildbot/#builders/43/builds/75/steps/16/logs/stdio

- 17: clean up ( success )
    Logs:
        - stdio: https://builder.sourceware.org/buildbot/#builders/43/builds/75/steps/17/logs/stdio

- 18: make distclean ( success )
    Logs:
        - stdio: https://builder.sourceware.org/buildbot/#builders/43/builds/75/steps/18/logs/stdio

A new failure has been detected on builder elfutils-fedora-ppc64le while building elfutils.

Full details are available at:
    https://builder.sourceware.org/buildbot/#builders/55/builds/74

Build state: failed test (failure)
Revision: 64ee2cb792e7b6ba6ad2a5759bff7ce8714e4668
Worker: fedora-ppc64le
Build Reason: (unknown)
Blamelist: Aleksei Vetrov <vvvvvv@google.com>

Steps:

- 0: worker_preparation ( success )

- 1: set package name ( success )

- 2: git checkout ( success )
    Logs:
        - stdio: https://builder.sourceware.org/buildbot/#builders/55/builds/74/steps/2/logs/stdio

- 3: autoreconf ( success )
    Logs:
        - stdio: https://builder.sourceware.org/buildbot/#builders/55/builds/74/steps/3/logs/stdio

- 4: configure ( success )
    Logs:
        - stdio: https://builder.sourceware.org/buildbot/#builders/55/builds/74/steps/4/logs/stdio

- 5: get version ( success )
    Logs:
        - stdio: https://builder.sourceware.org/buildbot/#builders/55/builds/74/steps/5/logs/stdio
        - property changes: https://builder.sourceware.org/buildbot/#builders/55/builds/74/steps/5/logs/property_changes

- 6: make ( warnings )
    Logs:
        - stdio: https://builder.sourceware.org/buildbot/#builders/55/builds/74/steps/6/logs/stdio
        - warnings (3): https://builder.sourceware.org/buildbot/#builders/55/builds/74/steps/6/logs/warnings__3_

- 7: make check ( failure )
    Logs:
        - stdio: https://builder.sourceware.org/buildbot/#builders/55/builds/74/steps/7/logs/stdio
        - test-suite.log: https://builder.sourceware.org/buildbot/#builders/55/builds/74/steps/7/logs/test-suite_log

- 8: prep ( success )
    Logs:
        - stdio: https://builder.sourceware.org/buildbot/#builders/55/builds/74/steps/8/logs/stdio

- 9: build bunsen.cpio.gz ( success )
    Logs:
        - stdio: https://builder.sourceware.org/buildbot/#builders/55/builds/74/steps/9/logs/stdio

- 10: fetch bunsen.cpio.gz ( success )
    Logs:
        - stdio: https://builder.sourceware.org/buildbot/#builders/55/builds/74/steps/10/logs/stdio

- 11: unpack bunsen.cpio.gz ( success )
    Logs:
        - stdio: https://builder.sourceware.org/buildbot/#builders/55/builds/74/steps/11/logs/stdio

- 12: pass .bunsen.source.gitname ( success )
    Logs:
        - stdio: https://builder.sourceware.org/buildbot/#builders/55/builds/74/steps/12/logs/stdio

- 13: pass .bunsen.source.gitdescribe ( success )
    Logs:
        - stdio: https://builder.sourceware.org/buildbot/#builders/55/builds/74/steps/13/logs/stdio

- 14: pass .bunsen.source.gitbranch ( success )
    Logs:
        - stdio: https://builder.sourceware.org/buildbot/#builders/55/builds/74/steps/14/logs/stdio

- 15: pass .bunsen.source.gitrepo ( success )
    Logs:
        - stdio: https://builder.sourceware.org/buildbot/#builders/55/builds/74/steps/15/logs/stdio

- 16: upload to bunsen ( success )
    Logs:
        - stdio: https://builder.sourceware.org/buildbot/#builders/55/builds/74/steps/16/logs/stdio

- 17: clean up ( success )
    Logs:
        - stdio: https://builder.sourceware.org/buildbot/#builders/55/builds/74/steps/17/logs/stdio

- 18: make distclean ( success )
    Logs:
        - stdio: https://builder.sourceware.org/buildbot/#builders/55/builds/74/steps/18/logs/stdio

A new failure has been detected on builder elfutils-debian-ppc64 while building elfutils.

Full details are available at:
    https://builder.sourceware.org/buildbot/#builders/63/builds/77

Build state: failed test (failure)
Revision: 64ee2cb792e7b6ba6ad2a5759bff7ce8714e4668
Worker: debian-ppc64
Build Reason: (unknown)
Blamelist: Aleksei Vetrov <vvvvvv@google.com>

Steps:

- 0: worker_preparation ( success )

- 1: set package name ( success )

- 2: git checkout ( success )
    Logs:
        - stdio: https://builder.sourceware.org/buildbot/#builders/63/builds/77/steps/2/logs/stdio

- 3: autoreconf ( success )
    Logs:
        - stdio: https://builder.sourceware.org/buildbot/#builders/63/builds/77/steps/3/logs/stdio

- 4: configure ( success )
    Logs:
        - stdio: https://builder.sourceware.org/buildbot/#builders/63/builds/77/steps/4/logs/stdio

- 5: get version ( success )
    Logs:
        - stdio: https://builder.sourceware.org/buildbot/#builders/63/builds/77/steps/5/logs/stdio
        - property changes: https://builder.sourceware.org/buildbot/#builders/63/builds/77/steps/5/logs/property_changes

- 6: make ( warnings )
    Logs:
        - stdio: https://builder.sourceware.org/buildbot/#builders/63/builds/77/steps/6/logs/stdio
        - warnings (3): https://builder.sourceware.org/buildbot/#builders/63/builds/77/steps/6/logs/warnings__3_

- 7: make check ( failure )
    Logs:
        - stdio: https://builder.sourceware.org/buildbot/#builders/63/builds/77/steps/7/logs/stdio
        - test-suite.log: https://builder.sourceware.org/buildbot/#builders/63/builds/77/steps/7/logs/test-suite_log

- 8: prep ( success )
    Logs:
        - stdio: https://builder.sourceware.org/buildbot/#builders/63/builds/77/steps/8/logs/stdio

- 9: build bunsen.cpio.gz ( success )
    Logs:
        - stdio: https://builder.sourceware.org/buildbot/#builders/63/builds/77/steps/9/logs/stdio

- 10: fetch bunsen.cpio.gz ( success )
    Logs:
        - stdio: https://builder.sourceware.org/buildbot/#builders/63/builds/77/steps/10/logs/stdio

- 11: unpack bunsen.cpio.gz ( success )
    Logs:
        - stdio: https://builder.sourceware.org/buildbot/#builders/63/builds/77/steps/11/logs/stdio

- 12: pass .bunsen.source.gitname ( success )
    Logs:
        - stdio: https://builder.sourceware.org/buildbot/#builders/63/builds/77/steps/12/logs/stdio

- 13: pass .bunsen.source.gitdescribe ( success )
    Logs:
        - stdio: https://builder.sourceware.org/buildbot/#builders/63/builds/77/steps/13/logs/stdio

- 14: pass .bunsen.source.gitbranch ( success )
    Logs:
        - stdio: https://builder.sourceware.org/buildbot/#builders/63/builds/77/steps/14/logs/stdio

- 15: pass .bunsen.source.gitrepo ( success )
    Logs:
        - stdio: https://builder.sourceware.org/buildbot/#builders/63/builds/77/steps/15/logs/stdio

- 16: upload to bunsen ( success )
    Logs:
        - stdio: https://builder.sourceware.org/buildbot/#builders/63/builds/77/steps/16/logs/stdio

- 17: clean up ( success )
    Logs:
        - stdio: https://builder.sourceware.org/buildbot/#builders/63/builds/77/steps/17/logs/stdio

- 18: make distclean ( success )
    Logs:
        - stdio: https://builder.sourceware.org/buildbot/#builders/63/builds/77/steps/18/logs/stdio

A new failure has been detected on builder elfutils-opensusetw-x86_64 while building elfutils.

Full details are available at:
    https://builder.sourceware.org/buildbot/#builders/88/builds/45

Build state: failed test (failure)
Revision: 64ee2cb792e7b6ba6ad2a5759bff7ce8714e4668
Worker: bb1-2
Build Reason: (unknown)
Blamelist: Aleksei Vetrov <vvvvvv@google.com>

Steps:

- 0: worker_preparation ( success )

- 1: set package name ( success )

- 2: git checkout ( success )
    Logs:
        - stdio: https://builder.sourceware.org/buildbot/#builders/88/builds/45/steps/2/logs/stdio

- 3: autoreconf ( success )
    Logs:
        - stdio: https://builder.sourceware.org/buildbot/#builders/88/builds/45/steps/3/logs/stdio

- 4: configure ( success )
    Logs:
        - stdio: https://builder.sourceware.org/buildbot/#builders/88/builds/45/steps/4/logs/stdio

- 5: get version ( success )
    Logs:
        - stdio: https://builder.sourceware.org/buildbot/#builders/88/builds/45/steps/5/logs/stdio
        - property changes: https://builder.sourceware.org/buildbot/#builders/88/builds/45/steps/5/logs/property_changes

- 6: make ( warnings )
    Logs:
        - stdio: https://builder.sourceware.org/buildbot/#builders/88/builds/45/steps/6/logs/stdio
        - warnings (3): https://builder.sourceware.org/buildbot/#builders/88/builds/45/steps/6/logs/warnings__3_

- 7: make check ( success )
    Logs:
        - stdio: https://builder.sourceware.org/buildbot/#builders/88/builds/45/steps/7/logs/stdio
        - test-suite.log: https://builder.sourceware.org/buildbot/#builders/88/builds/45/steps/7/logs/test-suite_log

- 8: make distcheck ( failure )
    Logs:
        - stdio: https://builder.sourceware.org/buildbot/#builders/88/builds/45/steps/8/logs/stdio
        - test-suite.log: https://builder.sourceware.org/buildbot/#builders/88/builds/45/steps/8/logs/test-suite_log
        - warnings (3): https://builder.sourceware.org/buildbot/#builders/88/builds/45/steps/8/logs/warnings__3_

- 9: prep ( success )
    Logs:
        - stdio: https://builder.sourceware.org/buildbot/#builders/88/builds/45/steps/9/logs/stdio

- 10: build bunsen.cpio.gz ( success )
    Logs:
        - stdio: https://builder.sourceware.org/buildbot/#builders/88/builds/45/steps/10/logs/stdio

- 11: fetch bunsen.cpio.gz ( success )
    Logs:
        - stdio: https://builder.sourceware.org/buildbot/#builders/88/builds/45/steps/11/logs/stdio

- 12: unpack bunsen.cpio.gz ( success )
    Logs:
        - stdio: https://builder.sourceware.org/buildbot/#builders/88/builds/45/steps/12/logs/stdio

- 13: pass .bunsen.source.gitname ( success )
    Logs:
        - stdio: https://builder.sourceware.org/buildbot/#builders/88/builds/45/steps/13/logs/stdio

- 14: pass .bunsen.source.gitdescribe ( success )
    Logs:
        - stdio: https://builder.sourceware.org/buildbot/#builders/88/builds/45/steps/14/logs/stdio

- 15: pass .bunsen.source.gitbranch ( success )
    Logs:
        - stdio: https://builder.sourceware.org/buildbot/#builders/88/builds/45/steps/15/logs/stdio

- 16: pass .bunsen.source.gitrepo ( success )
    Logs:
        - stdio: https://builder.sourceware.org/buildbot/#builders/88/builds/45/steps/16/logs/stdio

- 17: upload to bunsen ( success )
    Logs:
        - stdio: https://builder.sourceware.org/buildbot/#builders/88/builds/45/steps/17/logs/stdio

- 18: clean up ( success )
    Logs:
        - stdio: https://builder.sourceware.org/buildbot/#builders/88/builds/45/steps/18/logs/stdio

- 19: make distclean ( success )
    Logs:
        - stdio: https://builder.sourceware.org/buildbot/#builders/88/builds/45/steps/19/logs/stdio


^ permalink raw reply	[flat|nested] 41+ messages in thread

* ☠ Buildbot (GNU Toolchain): elfutils - failed test (failure) (master)
@ 2022-10-13 16:51 builder
  0 siblings, 0 replies; 41+ messages in thread
From: builder @ 2022-10-13 16:51 UTC (permalink / raw)
  To: elfutils-devel

A new failure has been detected on builder elfutils-centos-x86_64 while building elfutils.

Full details are available at:
    https://builder.sourceware.org/buildbot/#builders/39/builds/75

Build state: failed test (failure)
Revision: 6284f4d12ccbc6405e986fd84ac6d4d72dc9c2a7
Worker: centos-x86_64
Build Reason: (unknown)
Blamelist: Khem Raj <raj.khem@gmail.com>

Steps:

- 0: worker_preparation ( success )

- 1: set package name ( success )

- 2: git checkout ( success )
    Logs:
        - stdio: https://builder.sourceware.org/buildbot/#builders/39/builds/75/steps/2/logs/stdio

- 3: autoreconf ( success )
    Logs:
        - stdio: https://builder.sourceware.org/buildbot/#builders/39/builds/75/steps/3/logs/stdio

- 4: configure ( success )
    Logs:
        - stdio: https://builder.sourceware.org/buildbot/#builders/39/builds/75/steps/4/logs/stdio

- 5: get version ( success )
    Logs:
        - stdio: https://builder.sourceware.org/buildbot/#builders/39/builds/75/steps/5/logs/stdio
        - property changes: https://builder.sourceware.org/buildbot/#builders/39/builds/75/steps/5/logs/property_changes

- 6: make ( warnings )
    Logs:
        - stdio: https://builder.sourceware.org/buildbot/#builders/39/builds/75/steps/6/logs/stdio
        - warnings (2): https://builder.sourceware.org/buildbot/#builders/39/builds/75/steps/6/logs/warnings__2_

- 7: make check ( failure )
    Logs:
        - stdio: https://builder.sourceware.org/buildbot/#builders/39/builds/75/steps/7/logs/stdio
        - test-suite.log: https://builder.sourceware.org/buildbot/#builders/39/builds/75/steps/7/logs/test-suite_log

- 8: prep ( success )
    Logs:
        - stdio: https://builder.sourceware.org/buildbot/#builders/39/builds/75/steps/8/logs/stdio

- 9: build bunsen.cpio.gz ( success )
    Logs:
        - stdio: https://builder.sourceware.org/buildbot/#builders/39/builds/75/steps/9/logs/stdio

- 10: fetch bunsen.cpio.gz ( success )
    Logs:
        - stdio: https://builder.sourceware.org/buildbot/#builders/39/builds/75/steps/10/logs/stdio

- 11: unpack bunsen.cpio.gz ( success )
    Logs:
        - stdio: https://builder.sourceware.org/buildbot/#builders/39/builds/75/steps/11/logs/stdio

- 12: pass .bunsen.source.gitname ( success )
    Logs:
        - stdio: https://builder.sourceware.org/buildbot/#builders/39/builds/75/steps/12/logs/stdio

- 13: pass .bunsen.source.gitdescribe ( success )
    Logs:
        - stdio: https://builder.sourceware.org/buildbot/#builders/39/builds/75/steps/13/logs/stdio

- 14: pass .bunsen.source.gitbranch ( success )
    Logs:
        - stdio: https://builder.sourceware.org/buildbot/#builders/39/builds/75/steps/14/logs/stdio

- 15: pass .bunsen.source.gitrepo ( success )
    Logs:
        - stdio: https://builder.sourceware.org/buildbot/#builders/39/builds/75/steps/15/logs/stdio

- 16: upload to bunsen ( success )
    Logs:
        - stdio: https://builder.sourceware.org/buildbot/#builders/39/builds/75/steps/16/logs/stdio

- 17: clean up ( success )
    Logs:
        - stdio: https://builder.sourceware.org/buildbot/#builders/39/builds/75/steps/17/logs/stdio

- 18: make distclean ( success )
    Logs:
        - stdio: https://builder.sourceware.org/buildbot/#builders/39/builds/75/steps/18/logs/stdio


^ permalink raw reply	[flat|nested] 41+ messages in thread

* ☠ Buildbot (GNU Toolchain): elfutils - failed test (failure) (master)
@ 2022-09-14 19:36 builder
  0 siblings, 0 replies; 41+ messages in thread
From: builder @ 2022-09-14 19:36 UTC (permalink / raw)
  To: elfutils-devel

A new failure has been detected on builder elfutils-fedora-x86_64 while building elfutils.

Full details are available at:
    https://builder.sourceware.org/buildbot/#builders/59/builds/77

Build state: failed test (failure)
Revision: 6cb01b4ef3cdd4f83d21bbcec72fa66712ac14e6
Worker: bb2-1
Build Reason: (unknown)
Blamelist: Mark Wielaard <mark@klomp.org>

Steps:

- 0: worker_preparation ( success )

- 1: set package name ( success )

- 2: git checkout ( success )
    Logs:
        - stdio: https://builder.sourceware.org/buildbot/#builders/59/builds/77/steps/2/logs/stdio

- 3: autoreconf ( success )
    Logs:
        - stdio: https://builder.sourceware.org/buildbot/#builders/59/builds/77/steps/3/logs/stdio

- 4: configure ( success )
    Logs:
        - stdio: https://builder.sourceware.org/buildbot/#builders/59/builds/77/steps/4/logs/stdio

- 5: get version ( success )
    Logs:
        - stdio: https://builder.sourceware.org/buildbot/#builders/59/builds/77/steps/5/logs/stdio
        - property changes: https://builder.sourceware.org/buildbot/#builders/59/builds/77/steps/5/logs/property_changes

- 6: make ( warnings )
    Logs:
        - stdio: https://builder.sourceware.org/buildbot/#builders/59/builds/77/steps/6/logs/stdio
        - warnings (3): https://builder.sourceware.org/buildbot/#builders/59/builds/77/steps/6/logs/warnings__3_

- 7: make check ( success )
    Logs:
        - stdio: https://builder.sourceware.org/buildbot/#builders/59/builds/77/steps/7/logs/stdio
        - test-suite.log: https://builder.sourceware.org/buildbot/#builders/59/builds/77/steps/7/logs/test-suite_log

- 8: make distcheck ( failure )
    Logs:
        - stdio: https://builder.sourceware.org/buildbot/#builders/59/builds/77/steps/8/logs/stdio
        - test-suite.log: https://builder.sourceware.org/buildbot/#builders/59/builds/77/steps/8/logs/test-suite_log
        - warnings (6): https://builder.sourceware.org/buildbot/#builders/59/builds/77/steps/8/logs/warnings__6_

- 9: prep ( success )
    Logs:
        - stdio: https://builder.sourceware.org/buildbot/#builders/59/builds/77/steps/9/logs/stdio

- 10: build bunsen.cpio.gz ( success )
    Logs:
        - stdio: https://builder.sourceware.org/buildbot/#builders/59/builds/77/steps/10/logs/stdio

- 11: fetch bunsen.cpio.gz ( success )
    Logs:
        - stdio: https://builder.sourceware.org/buildbot/#builders/59/builds/77/steps/11/logs/stdio

- 12: unpack bunsen.cpio.gz ( success )
    Logs:
        - stdio: https://builder.sourceware.org/buildbot/#builders/59/builds/77/steps/12/logs/stdio

- 13: pass .bunsen.source.gitname ( success )
    Logs:
        - stdio: https://builder.sourceware.org/buildbot/#builders/59/builds/77/steps/13/logs/stdio

- 14: pass .bunsen.source.gitdescribe ( success )
    Logs:
        - stdio: https://builder.sourceware.org/buildbot/#builders/59/builds/77/steps/14/logs/stdio

- 15: pass .bunsen.source.gitbranch ( success )
    Logs:
        - stdio: https://builder.sourceware.org/buildbot/#builders/59/builds/77/steps/15/logs/stdio

- 16: pass .bunsen.source.gitrepo ( success )
    Logs:
        - stdio: https://builder.sourceware.org/buildbot/#builders/59/builds/77/steps/16/logs/stdio

- 17: upload to bunsen ( success )
    Logs:
        - stdio: https://builder.sourceware.org/buildbot/#builders/59/builds/77/steps/17/logs/stdio

- 18: clean up ( success )
    Logs:
        - stdio: https://builder.sourceware.org/buildbot/#builders/59/builds/77/steps/18/logs/stdio

- 19: make distclean ( success )
    Logs:
        - stdio: https://builder.sourceware.org/buildbot/#builders/59/builds/77/steps/19/logs/stdio


^ permalink raw reply	[flat|nested] 41+ messages in thread

* Re: ☠ Buildbot (GNU Toolchain): elfutils - failed test (failure) (master)
  2022-05-28  9:43   ` Mark Wielaard
@ 2022-06-02 15:44     ` Mark Wielaard
  0 siblings, 0 replies; 41+ messages in thread
From: Mark Wielaard @ 2022-06-02 15:44 UTC (permalink / raw)
  To: elfutils-devel

[-- Attachment #1: Type: text/plain, Size: 4288 bytes --]

On Sat, 2022-05-28 at 11:43 +0200, Mark Wielaard wrote:
> On Sat, May 28, 2022 at 11:35:19AM +0200, Mark Wielaard wrote:
> > Retrying with ulimit -c unlimited...
> > 
> > O! It failed again, now with core
> > 
> > (gdb) where
> > #0  0x00007f4d528be387 in __GI_raise (sig=sig@entry=6) at
> > ../nptl/sysdeps/unix/sysv/linux/raise.c:55
> > #1  0x00007f4d528bfa78 in __GI_abort () at abort.c:90
> > #2  0x00007f4d53dfae1f in mhd_panic_std (cls=<optimized out>,
> > file=<optimized out>, 
> >     line=<optimized out>, reason=<optimized out>) at daemon.c:117
> > #3  0x00007f4d53dfc69e in MHD_cleanup_connections (
> > daemon=daemon@entry=0xdf38e0) at daemon.c:1826
> > #4  0x00007f4d53dfdf60 in MHD_run_from_select (daemon=daemon@entry=
> > 0xdf38e0, 
> >     read_fd_set=read_fd_set@entry=0x7f4d4c153c10, 
> > write_fd_set=write_fd_set@entry=0x7f4d4c153c90, 
> >     except_fd_set=except_fd_set@entry=0x7f4d4c153d10) at
> > daemon.c:2014
> > #5  0x00007f4d53dfe1e9 in MHD_select (daemon=daemon@entry=0xdf38e0,
> > may_block=may_block@entry=1)
> >     at daemon.c:2109
> > #6  0x00007f4d53dfe3b2 in MHD_select_thread (cls=0xdf38e0) at
> > daemon.c:2632
> > #7  0x00007f4d53681ea5 in start_thread (arg=0x7f4d4c154700) at
> > pthread_create.c:307
> > #8  0x00007f4d52986b0d in clone () at
> > ../sysdeps/unix/sysv/linux/x86_64/clone.S:111
> > 
> > (gdb) 
> > #3  0x00007f4d53dfc69e in MHD_cleanup_connections (
> > daemon=daemon@entry=0xdf38e0) at daemon.c:1826
> > 1826		    MHD_PANIC ("close failed\n");
> > (gdb) list
> > 1821		{
> > 1822	#ifdef WINDOWS
> > 1823		  SHUTDOWN (pos->socket_fd, SHUT_WR);
> > 1824	#endif
> > 1825		  if (0 != CLOSE (pos->socket_fd))
> > 1826		    MHD_PANIC ("close failed\n");
> > 1827		}
> > 1828	      if (NULL != pos->addr)
> > 1829		free (pos->addr);
> > 1830	      free (pos);
> > 
> > Hohum. That does look like a bug in libmicrohttpd. Or do we
> > manipulate
> > the socket_fd in any way?
> 
> And in case it is useful for analysis:
> 
> (gdb) print *pos
> $2 = {nextE = 0x0, prevE = 0x0, next = 0x0, prev = 0x0, nextX = 0x0,
> prevX = 0x0, daemon = 0xdf38e0, 
>   headers_received = 0x0, headers_received_tail = 0x0, response =
> 0x0, pool = 0x7f4d242f2450, 
>   client_context = 0x0, method = 0x0, url = 0x0, version = 0x0, 
>   read_buffer = 0x7f4d242f2480 "\240\355\v$M\177", write_buffer =
> 0x0, last = 0x0, colon = 0x0, 
>   addr = 0x7f4d242fa490, pid = 139968370415360, read_buffer_size =
> 16384, read_buffer_offset = 0, 
>   write_buffer_size = 0, write_buffer_send_offset = 0,
> write_buffer_append_offset = 0, 
>   remaining_upload_size = 0, response_write_position = 0,
> continue_message_write_offset = 0, 
>   addr_len = 28, last_activity = 599293, connection_timeout = 0,
> client_aware = 0, socket_fd = 96, 
>   read_closed = 1, thread_joined = 0, in_idle = 0, epoll_state =
> MHD_EPOLL_STATE_UNREADY, 
>   state = MHD_CONNECTION_CLOSED, event_loop_info =
> MHD_EVENT_LOOP_INFO_CLEANUP, responseCode = 0, 
>   response_unready = 0, have_chunked_upload = 0, current_chunk_size =
> 0, current_chunk_offset = 0, 
>   read_handler = 0x7f4d53df7680 <MHD_connection_handle_read>, 
>   write_handler = 0x7f4d53df78d0 <MHD_connection_handle_write>, 
>   idle_handler = 0x7f4d53df83a0 <MHD_connection_handle_idle>, 
>   recv_cls = 0x7f4d53dfa030 <recv_param_adapter>, send_cls =
> 0x7f4d53df9ec0 <send_param_adapter>, 
>   tls_session = 0x0, protocol = 0, cipher = 0, tls_read_ready = 0,
> suspended = 0, resuming = 0}
> 
> $ rpm -q libmicrohttpd
> libmicrohttpd-0.9.33-2.el7.x86_64

I tried to debug this a bit. But the code is really different from any
more recent version of libmicrohttpd. Somewhere libmicrohttpd looses
track of the state of the file descriptor and then it just aborts in
cleanup. I couldn't find a way to work around it. The version is so old
that it doesn't actually use any of the modern flags (MHD_USE_EPOLL,
MHD_USE_INTERNAL_POLLING_THREAD and MHD_USE_ITC are all not available).

Even reducing the number of fetches in run-debuginfod-federation-
metrics.sh doesn't prevent it from crashing.

I gave up and just wrote this ugly version based patch to not run the
testcase on such old libmicrohttpd.

Cheers,

Mark


[-- Attachment #2: Type: text/x-patch, Size: 3410 bytes --]

From 8cbadd86c147eeaec4344ac65ad00ea96ae1451a Mon Sep 17 00:00:00 2001
From: Mark Wielaard <mark@klomp.org>
Date: Thu, 2 Jun 2022 17:36:39 +0200
Subject: [PATCH] tests: Disable run-debuginfod-federation-metrics.sh for old
 libmicrohttpd

On really old libmicrohttpd the run-debuginfod-federation-metrics.sh
test will crash debuginfod after too many file descriptors have been
used. libmicrohttpd looses track of the state and aborts instead of
producing an error. Just disable the testcase on these very old versions.

Signed-off-by: Mark Wielaard <mark@klomp.org>
---
 ChangeLog         | 5 +++++
 configure.ac      | 2 ++
 tests/ChangeLog   | 5 +++++
 tests/Makefile.am | 6 +++++-
 4 files changed, 17 insertions(+), 1 deletion(-)

diff --git a/ChangeLog b/ChangeLog
index f1a14b5c..c5e43e8c 100644
--- a/ChangeLog
+++ b/ChangeLog
@@ -1,3 +1,8 @@
+2022-06-02  Mark Wielaard  <mark@klomp.org>
+
+	* configure.ac (OLD_LIBMICROHTTPD): New AM_CONDITIONAL based on
+	libmicrohttpd < 0.9.51.
+
 2022-05-02  Mark Wielaard  <mark@klomp.org>
 
 	* Makefile.am (AM_DISTCHECK_CONFIGURE_FLAGS): Remove
diff --git a/configure.ac b/configure.ac
index 11d1cf82..03b67a9d 100644
--- a/configure.ac
+++ b/configure.ac
@@ -783,6 +783,7 @@ AS_IF([test "x$enable_debuginfod" != "xno"], [
     enable_debuginfod=yes # presume success
     PKG_PROG_PKG_CONFIG
     PKG_CHECK_MODULES([libmicrohttpd],[libmicrohttpd >= 0.9.33],[],[enable_debuginfod=no])
+    PKG_CHECK_MODULES([oldlibmicrohttpd],[libmicrohttpd < 0.9.51],[old_libmicrohttpd=yes],[old_libmicrohttpd=no])
     PKG_CHECK_MODULES([sqlite3],[sqlite3 >= 3.7.17],[],[enable_debuginfod=no])
     PKG_CHECK_MODULES([libarchive],[libarchive >= 3.1.2],[],[enable_debuginfod=no])
     if test "x$enable_debuginfod" = "xno"; then
@@ -792,6 +793,7 @@ AS_IF([test "x$enable_debuginfod" != "xno"], [
 
 AS_IF([test "x$enable_debuginfod" != "xno"],AC_DEFINE([ENABLE_DEBUGINFOD],[1],[Build debuginfod]))
 AM_CONDITIONAL([DEBUGINFOD],[test "x$enable_debuginfod" = "xyes"])
+AM_CONDITIONAL([OLD_LIBMICROHTTPD],[test "x$old_libmicrohttpd" = "xyes"])
 
 dnl for /etc/profile.d/elfutils.{csh,sh}
 default_debuginfod_urls=""
diff --git a/tests/ChangeLog b/tests/ChangeLog
index 44b8df88..fb956925 100644
--- a/tests/ChangeLog
+++ b/tests/ChangeLog
@@ -1,3 +1,8 @@
+2022-06-02  Mark Wielaard  <mark@klomp.org>
+
+	* Makefile.am (TESTS): Add run-debuginfod-federation-metrics.sh
+	only when OLD_LIBMICROHTTPD conditional is not set.
+
 2022-04-24  Mark Wielaard  <mark@klomp.org>
 
 	* run-debuginfod-webapi-concurrency.sh: Fix PR number in xfail.
diff --git a/tests/Makefile.am b/tests/Makefile.am
index 84c3950a..d30b07c4 100644
--- a/tests/Makefile.am
+++ b/tests/Makefile.am
@@ -238,13 +238,17 @@ TESTS += run-debuginfod-dlopen.sh \
 	 run-debuginfod-archive-test.sh \
 	 run-debuginfod-federation-sqlite.sh \
 	 run-debuginfod-federation-link.sh \
-	 run-debuginfod-federation-metrics.sh \
          run-debuginfod-percent-escape.sh \
          run-debuginfod-x-forwarded-for.sh \
          run-debuginfod-response-headers.sh \
          run-debuginfod-extraction-passive.sh \
 	 run-debuginfod-webapi-concurrency.sh
 endif
+if !OLD_LIBMICROHTTPD
+# Will crash on too old libmicrohttpd
+# Too many open file descriptors confuses libmicrohttpd < 0.9.51
+TESTS += run-debuginfod-federation-metrics.sh
+endif
 endif
 
 EXTRA_DIST = run-arextract.sh run-arsymtest.sh run-ar.sh \
-- 
2.18.4


^ permalink raw reply	[flat|nested] 41+ messages in thread

* Re: ☠ Buildbot (GNU Toolchain): elfutils - failed test (failure) (master)
  2022-05-28  9:35 ` Mark Wielaard
@ 2022-05-28  9:43   ` Mark Wielaard
  2022-06-02 15:44     ` Mark Wielaard
  0 siblings, 1 reply; 41+ messages in thread
From: Mark Wielaard @ 2022-05-28  9:43 UTC (permalink / raw)
  To: elfutils-devel

On Sat, May 28, 2022 at 11:35:19AM +0200, Mark Wielaard wrote:
> Retrying with ulimit -c unlimited...
> 
> O! It failed again, now with core
> 
> (gdb) where
> #0  0x00007f4d528be387 in __GI_raise (sig=sig@entry=6) at ../nptl/sysdeps/unix/sysv/linux/raise.c:55
> #1  0x00007f4d528bfa78 in __GI_abort () at abort.c:90
> #2  0x00007f4d53dfae1f in mhd_panic_std (cls=<optimized out>, file=<optimized out>, 
>     line=<optimized out>, reason=<optimized out>) at daemon.c:117
> #3  0x00007f4d53dfc69e in MHD_cleanup_connections (daemon=daemon@entry=0xdf38e0) at daemon.c:1826
> #4  0x00007f4d53dfdf60 in MHD_run_from_select (daemon=daemon@entry=0xdf38e0, 
>     read_fd_set=read_fd_set@entry=0x7f4d4c153c10, write_fd_set=write_fd_set@entry=0x7f4d4c153c90, 
>     except_fd_set=except_fd_set@entry=0x7f4d4c153d10) at daemon.c:2014
> #5  0x00007f4d53dfe1e9 in MHD_select (daemon=daemon@entry=0xdf38e0, may_block=may_block@entry=1)
>     at daemon.c:2109
> #6  0x00007f4d53dfe3b2 in MHD_select_thread (cls=0xdf38e0) at daemon.c:2632
> #7  0x00007f4d53681ea5 in start_thread (arg=0x7f4d4c154700) at pthread_create.c:307
> #8  0x00007f4d52986b0d in clone () at ../sysdeps/unix/sysv/linux/x86_64/clone.S:111
> 
> (gdb) 
> #3  0x00007f4d53dfc69e in MHD_cleanup_connections (daemon=daemon@entry=0xdf38e0) at daemon.c:1826
> 1826		    MHD_PANIC ("close failed\n");
> (gdb) list
> 1821		{
> 1822	#ifdef WINDOWS
> 1823		  SHUTDOWN (pos->socket_fd, SHUT_WR);
> 1824	#endif
> 1825		  if (0 != CLOSE (pos->socket_fd))
> 1826		    MHD_PANIC ("close failed\n");
> 1827		}
> 1828	      if (NULL != pos->addr)
> 1829		free (pos->addr);
> 1830	      free (pos);
> 
> Hohum. That does look like a bug in libmicrohttpd. Or do we manipulate
> the socket_fd in any way?

And in case it is useful for analysis:

(gdb) print *pos
$2 = {nextE = 0x0, prevE = 0x0, next = 0x0, prev = 0x0, nextX = 0x0, prevX = 0x0, daemon = 0xdf38e0, 
  headers_received = 0x0, headers_received_tail = 0x0, response = 0x0, pool = 0x7f4d242f2450, 
  client_context = 0x0, method = 0x0, url = 0x0, version = 0x0, 
  read_buffer = 0x7f4d242f2480 "\240\355\v$M\177", write_buffer = 0x0, last = 0x0, colon = 0x0, 
  addr = 0x7f4d242fa490, pid = 139968370415360, read_buffer_size = 16384, read_buffer_offset = 0, 
  write_buffer_size = 0, write_buffer_send_offset = 0, write_buffer_append_offset = 0, 
  remaining_upload_size = 0, response_write_position = 0, continue_message_write_offset = 0, 
  addr_len = 28, last_activity = 599293, connection_timeout = 0, client_aware = 0, socket_fd = 96, 
  read_closed = 1, thread_joined = 0, in_idle = 0, epoll_state = MHD_EPOLL_STATE_UNREADY, 
  state = MHD_CONNECTION_CLOSED, event_loop_info = MHD_EVENT_LOOP_INFO_CLEANUP, responseCode = 0, 
  response_unready = 0, have_chunked_upload = 0, current_chunk_size = 0, current_chunk_offset = 0, 
  read_handler = 0x7f4d53df7680 <MHD_connection_handle_read>, 
  write_handler = 0x7f4d53df78d0 <MHD_connection_handle_write>, 
  idle_handler = 0x7f4d53df83a0 <MHD_connection_handle_idle>, 
  recv_cls = 0x7f4d53dfa030 <recv_param_adapter>, send_cls = 0x7f4d53df9ec0 <send_param_adapter>, 
  tls_session = 0x0, protocol = 0, cipher = 0, tls_read_ready = 0, suspended = 0, resuming = 0}

$ rpm -q libmicrohttpd
libmicrohttpd-0.9.33-2.el7.x86_64

Cheers,

Mark

^ permalink raw reply	[flat|nested] 41+ messages in thread

* Re: ☠ Buildbot (GNU Toolchain): elfutils - failed test (failure) (master)
  2022-05-28  9:15 builder
@ 2022-05-28  9:35 ` Mark Wielaard
  2022-05-28  9:43   ` Mark Wielaard
  0 siblings, 1 reply; 41+ messages in thread
From: Mark Wielaard @ 2022-05-28  9:35 UTC (permalink / raw)
  To: elfutils-devel

Hi,

On Sat, May 28, 2022 at 09:15:30AM +0000, builder--- via Elfutils-devel wrote:
> A new failure has been detected on builder elfutils-centos-x86_64 while building elfutils.
> 
> Full details are available at:
>     https://builder.sourceware.org/buildbot/#builders/39/builds/33
> 
> Build state: failed test (failure)
> Revision: b8713b3fd0617415c76df8c9da70f8e2f26d3134
> Worker: centos-x86_64
> Build Reason: (unknown)
> Blamelist: Mark Wielaard <mark@klomp.org>
> 
> - 7: make check ( failure )
>     Logs:
>         - stdio: https://builder.sourceware.org/buildbot/#builders/39/builds/33/steps/7/logs/stdio
>         - test-suite.log: https://builder.sourceware.org/buildbot/#builders/39/builds/33/steps/7/logs/test-suite_log

Well that is interesting, fails at the same point:

/srv/buildbot/worker/elfutils-centos-x86_64/build/tests/run-debuginfod-federation-metrics.sh: line 198: 23793 Aborted                 env LD_LIBRARY_PATH=$ldpath ${abs_builddir}/../debuginfod/debuginfod $VERBOSE -d ${DB} -F -U -t0 -g0 -p $PORT1 L D F > vlog$PORT1 2>&1

Still no core :{

Retrying with ulimit -c unlimited...

O! It failed again, now with core

(gdb) where
#0  0x00007f4d528be387 in __GI_raise (sig=sig@entry=6) at ../nptl/sysdeps/unix/sysv/linux/raise.c:55
#1  0x00007f4d528bfa78 in __GI_abort () at abort.c:90
#2  0x00007f4d53dfae1f in mhd_panic_std (cls=<optimized out>, file=<optimized out>, 
    line=<optimized out>, reason=<optimized out>) at daemon.c:117
#3  0x00007f4d53dfc69e in MHD_cleanup_connections (daemon=daemon@entry=0xdf38e0) at daemon.c:1826
#4  0x00007f4d53dfdf60 in MHD_run_from_select (daemon=daemon@entry=0xdf38e0, 
    read_fd_set=read_fd_set@entry=0x7f4d4c153c10, write_fd_set=write_fd_set@entry=0x7f4d4c153c90, 
    except_fd_set=except_fd_set@entry=0x7f4d4c153d10) at daemon.c:2014
#5  0x00007f4d53dfe1e9 in MHD_select (daemon=daemon@entry=0xdf38e0, may_block=may_block@entry=1)
    at daemon.c:2109
#6  0x00007f4d53dfe3b2 in MHD_select_thread (cls=0xdf38e0) at daemon.c:2632
#7  0x00007f4d53681ea5 in start_thread (arg=0x7f4d4c154700) at pthread_create.c:307
#8  0x00007f4d52986b0d in clone () at ../sysdeps/unix/sysv/linux/x86_64/clone.S:111

(gdb) 
#3  0x00007f4d53dfc69e in MHD_cleanup_connections (daemon=daemon@entry=0xdf38e0) at daemon.c:1826
1826		    MHD_PANIC ("close failed\n");
(gdb) list
1821		{
1822	#ifdef WINDOWS
1823		  SHUTDOWN (pos->socket_fd, SHUT_WR);
1824	#endif
1825		  if (0 != CLOSE (pos->socket_fd))
1826		    MHD_PANIC ("close failed\n");
1827		}
1828	      if (NULL != pos->addr)
1829		free (pos->addr);
1830	      free (pos);

Hohum. That does look like a bug in libmicrohttpd. Or do we manipulate
the socket_fd in any way?

Cheers,

Mark


^ permalink raw reply	[flat|nested] 41+ messages in thread

* ☠ Buildbot (GNU Toolchain): elfutils - failed test (failure) (master)
@ 2022-05-28  9:15 builder
  2022-05-28  9:35 ` Mark Wielaard
  0 siblings, 1 reply; 41+ messages in thread
From: builder @ 2022-05-28  9:15 UTC (permalink / raw)
  To: elfutils-devel

A new failure has been detected on builder elfutils-centos-x86_64 while building elfutils.

Full details are available at:
    https://builder.sourceware.org/buildbot/#builders/39/builds/33

Build state: failed test (failure)
Revision: b8713b3fd0617415c76df8c9da70f8e2f26d3134
Worker: centos-x86_64
Build Reason: (unknown)
Blamelist: Mark Wielaard <mark@klomp.org>

Steps:

- 0: worker_preparation ( success )

- 1: set package name ( success )

- 2: git checkout ( success )
    Logs:
        - stdio: https://builder.sourceware.org/buildbot/#builders/39/builds/33/steps/2/logs/stdio

- 3: autoreconf ( success )
    Logs:
        - stdio: https://builder.sourceware.org/buildbot/#builders/39/builds/33/steps/3/logs/stdio

- 4: configure ( success )
    Logs:
        - stdio: https://builder.sourceware.org/buildbot/#builders/39/builds/33/steps/4/logs/stdio

- 5: get version ( success )
    Logs:
        - stdio: https://builder.sourceware.org/buildbot/#builders/39/builds/33/steps/5/logs/stdio
        - property changes: https://builder.sourceware.org/buildbot/#builders/39/builds/33/steps/5/logs/property_changes

- 6: make ( warnings )
    Logs:
        - stdio: https://builder.sourceware.org/buildbot/#builders/39/builds/33/steps/6/logs/stdio
        - warnings (2): https://builder.sourceware.org/buildbot/#builders/39/builds/33/steps/6/logs/warnings__2_

- 7: make check ( failure )
    Logs:
        - stdio: https://builder.sourceware.org/buildbot/#builders/39/builds/33/steps/7/logs/stdio
        - test-suite.log: https://builder.sourceware.org/buildbot/#builders/39/builds/33/steps/7/logs/test-suite_log

- 8: prep ( success )
    Logs:
        - stdio: https://builder.sourceware.org/buildbot/#builders/39/builds/33/steps/8/logs/stdio

- 9: fetch ['tests/*.trs', 'tests/*.log'] ( success )
    Logs:
        - stdio: https://builder.sourceware.org/buildbot/#builders/39/builds/33/steps/9/logs/stdio

- 10: fetch ['elfutils-*/_build/sub/tests/*.trs', 'elfut ( skipped )
    Logs:
        - stdio: https://builder.sourceware.org/buildbot/#builders/39/builds/33/steps/10/logs/stdio

- 11: fetch ['config.log'] ( success )
    Logs:
        - stdio: https://builder.sourceware.org/buildbot/#builders/39/builds/33/steps/11/logs/stdio

- 12: fetch ['elfutils-*/_build/sub/config.log'] ( skipped )
    Logs:
        - stdio: https://builder.sourceware.org/buildbot/#builders/39/builds/33/steps/12/logs/stdio

- 13: pass .bunsen.source.gitname ( success )
    Logs:
        - stdio: https://builder.sourceware.org/buildbot/#builders/39/builds/33/steps/13/logs/stdio

- 14: pass .bunsen.source.gitrepo ( success )
    Logs:
        - stdio: https://builder.sourceware.org/buildbot/#builders/39/builds/33/steps/14/logs/stdio

- 15: upload to bunsen ( success )
    Logs:
        - stdio: https://builder.sourceware.org/buildbot/#builders/39/builds/33/steps/15/logs/stdio

- 16: clean up ( success )
    Logs:
        - stdio: https://builder.sourceware.org/buildbot/#builders/39/builds/33/steps/16/logs/stdio


^ permalink raw reply	[flat|nested] 41+ messages in thread

* Re: ☠ Buildbot (GNU Toolchain): elfutils - failed test (failure) (master)
  2022-05-28  2:34   ` Frank Ch. Eigler
@ 2022-05-28  9:04     ` Mark Wielaard
  0 siblings, 0 replies; 41+ messages in thread
From: Mark Wielaard @ 2022-05-28  9:04 UTC (permalink / raw)
  To: Frank Ch. Eigler; +Cc: elfutils-devel

On Fri, May 27, 2022 at 10:34:19PM -0400, Frank Ch. Eigler wrote:
> Hi -
> 
> n-metrics.sh: line 198: 27160 Aborted                 (core dumped) env LD_LIBRARY_PATH=$ldpath ${abs_builddir}/../debuginfod/debuginfod $VERBOSE -d ${DB} -F -U -t0 -g0 -p $PORT1 L D F > vlog$PORT1 2>&1
> > [...]
> > Process 27160 (debuginfod) of user 994 killed by SIGABRT - ignoring (low free space)
> > Lets see what happens on a rebuild.
> 
> Did the machine run out of memory / storage?

Maybe, hard to tell from the logs. At the moment it looks like:

$ df -h
Filesystem      Size  Used Avail Use% Mounted on
devtmpfs        3.7G     0  3.7G   0% /dev
tmpfs           3.7G     0  3.7G   0% /dev/shm
tmpfs           3.7G   17M  3.7G   1% /run
tmpfs           3.7G     0  3.7G   0% /sys/fs/cgroup
/dev/vda2        12G   11G  881M  93% /
/dev/vdb1        40G  8.3G   32G  21% /srv
tmpfs           748M     0  748M   0% /run/user/994
tmpfs           748M     0  748M   0% /run/user/1000
$ free -h
              total        used        free      shared  buff/cache   available
Mem:           7.3G        418M        2.4G         16M        4.5G        6.6G
Swap:          511M          0B        511M

So maybe / was slightly full. The buildbot itself runs under /srv/
I freed 2.5G from / and uninstalled abrt so it doesn't intercept
generating the core files.

Cheers,

Mark


^ permalink raw reply	[flat|nested] 41+ messages in thread

* Re: ☠ Buildbot (GNU Toolchain): elfutils - failed test (failure) (master)
  2022-05-27 22:30 ` Mark Wielaard
@ 2022-05-28  2:34   ` Frank Ch. Eigler
  2022-05-28  9:04     ` Mark Wielaard
  0 siblings, 1 reply; 41+ messages in thread
From: Frank Ch. Eigler @ 2022-05-28  2:34 UTC (permalink / raw)
  To: Mark Wielaard; +Cc: elfutils-devel

Hi -

n-metrics.sh: line 198: 27160 Aborted                 (core dumped) env LD_LIBRARY_PATH=$ldpath ${abs_builddir}/../debuginfod/debuginfod $VERBOSE -d ${DB} -F -U -t0 -g0 -p $PORT1 L D F > vlog$PORT1 2>&1
> [...]
> Process 27160 (debuginfod) of user 994 killed by SIGABRT - ignoring (low free space)
> Lets see what happens on a rebuild.

Did the machine run out of memory / storage?

- FChE


^ permalink raw reply	[flat|nested] 41+ messages in thread

* Re: ☠ Buildbot (GNU Toolchain): elfutils - failed test (failure) (master)
  2022-05-27 16:02 builder
@ 2022-05-27 22:30 ` Mark Wielaard
  2022-05-28  2:34   ` Frank Ch. Eigler
  0 siblings, 1 reply; 41+ messages in thread
From: Mark Wielaard @ 2022-05-27 22:30 UTC (permalink / raw)
  To: elfutils-devel

On Fri, May 27, 2022 at 04:02:41PM +0000, builder--- via Elfutils-devel wrote:
> A new failure has been detected on builder elfutils-centos-x86_64 while building elfutils.
> 
> Full details are available at:
>     https://builder.sourceware.org/buildbot/#builders/39/builds/31
> 
> Build state: failed test (failure)
> Revision: b8713b3fd0617415c76df8c9da70f8e2f26d3134
> Worker: centos-x86_64
> Build Reason: (unknown)
> Blamelist: Mark Wielaard <mark@klomp.org>
> 
> Steps:
> [...]
> - 7: make check ( failure )
>     Logs:
>         - stdio: https://builder.sourceware.org/buildbot/#builders/39/builds/31/steps/7/logs/stdio
>         - test-suite.log: https://builder.sourceware.org/buildbot/#builders/39/builds/31/steps/7/logs/test-suite_log

The failure comes from run-debuginfod-federation-metrics.sh, this
part:

# Trigger a flood of requests against the same archive content file.
# Use a file that hasn't been previously extracted in to make it
# likely that even this test debuginfod will experience concurrency
# and impose some "after-you" delays.
(for i in `seq 100`; do
    curl -s http://127.0.0.1:$PORT1/buildid/87c08d12c78174f1082b7c888b3238219b0eb265/executable >/dev/null &
 done;
 wait)
curl -s http://127.0.0.1:$PORT1/metrics | grep 'http_responses_after_you.*'

Where the error is:

+ curl -s http://127.0.0.1:9025/metrics
+ grep 'http_responses_after_you.*'
/srv/buildbot/worker/elfutils-centos-x86_64/build/tests/run-debuginfod-federation-metrics.sh: line 198: 27160 Aborted                 (core dumped) env LD_LIBRARY_PATH=$ldpath ${abs_builddir}/../debuginfod/debuginfod $VERBOSE -d ${DB} -F -U -t0 -g0 -p $PORT1 L D F > vlog$PORT1 2>&1
++ err
++ trap - ERR
++ echo ERROR REPORTS

This doesn't really make sense to me. Sadly the test machine doesn't actually have a core file:
Process 27160 (debuginfod) of user 994 killed by SIGABRT - ignoring (low free space)

Lets see what happens on a rebuild.

Cheers,

Mark


^ permalink raw reply	[flat|nested] 41+ messages in thread

* ☠ Buildbot (GNU Toolchain): elfutils - failed test (failure) (master)
@ 2022-05-27 16:02 builder
  2022-05-27 22:30 ` Mark Wielaard
  0 siblings, 1 reply; 41+ messages in thread
From: builder @ 2022-05-27 16:02 UTC (permalink / raw)
  To: elfutils-devel

A new failure has been detected on builder elfutils-centos-x86_64 while building elfutils.

Full details are available at:
    https://builder.sourceware.org/buildbot/#builders/39/builds/31

Build state: failed test (failure)
Revision: b8713b3fd0617415c76df8c9da70f8e2f26d3134
Worker: centos-x86_64
Build Reason: (unknown)
Blamelist: Mark Wielaard <mark@klomp.org>

Steps:

- 0: worker_preparation ( success )

- 1: set package name ( success )

- 2: git checkout ( success )
    Logs:
        - stdio: https://builder.sourceware.org/buildbot/#builders/39/builds/31/steps/2/logs/stdio

- 3: autoreconf ( success )
    Logs:
        - stdio: https://builder.sourceware.org/buildbot/#builders/39/builds/31/steps/3/logs/stdio

- 4: configure ( success )
    Logs:
        - stdio: https://builder.sourceware.org/buildbot/#builders/39/builds/31/steps/4/logs/stdio

- 5: get version ( success )
    Logs:
        - stdio: https://builder.sourceware.org/buildbot/#builders/39/builds/31/steps/5/logs/stdio
        - property changes: https://builder.sourceware.org/buildbot/#builders/39/builds/31/steps/5/logs/property_changes

- 6: make ( warnings )
    Logs:
        - stdio: https://builder.sourceware.org/buildbot/#builders/39/builds/31/steps/6/logs/stdio
        - warnings (2): https://builder.sourceware.org/buildbot/#builders/39/builds/31/steps/6/logs/warnings__2_

- 7: make check ( failure )
    Logs:
        - stdio: https://builder.sourceware.org/buildbot/#builders/39/builds/31/steps/7/logs/stdio
        - test-suite.log: https://builder.sourceware.org/buildbot/#builders/39/builds/31/steps/7/logs/test-suite_log

- 8: prep ( success )
    Logs:
        - stdio: https://builder.sourceware.org/buildbot/#builders/39/builds/31/steps/8/logs/stdio

- 9: fetch ['tests/*.trs', 'tests/*.log'] ( success )
    Logs:
        - stdio: https://builder.sourceware.org/buildbot/#builders/39/builds/31/steps/9/logs/stdio

- 10: fetch ['elfutils-*/_build/sub/tests/*.trs', 'elfut ( skipped )
    Logs:
        - stdio: https://builder.sourceware.org/buildbot/#builders/39/builds/31/steps/10/logs/stdio

- 11: fetch ['config.log'] ( success )
    Logs:
        - stdio: https://builder.sourceware.org/buildbot/#builders/39/builds/31/steps/11/logs/stdio

- 12: fetch ['elfutils-*/_build/sub/config.log'] ( skipped )
    Logs:
        - stdio: https://builder.sourceware.org/buildbot/#builders/39/builds/31/steps/12/logs/stdio

- 13: pass .bunsen.source.gitname ( success )
    Logs:
        - stdio: https://builder.sourceware.org/buildbot/#builders/39/builds/31/steps/13/logs/stdio

- 14: pass .bunsen.source.gitrepo ( success )
    Logs:
        - stdio: https://builder.sourceware.org/buildbot/#builders/39/builds/31/steps/14/logs/stdio

- 15: upload to bunsen ( success )
    Logs:
        - stdio: https://builder.sourceware.org/buildbot/#builders/39/builds/31/steps/15/logs/stdio

- 16: clean up ( success )
    Logs:
        - stdio: https://builder.sourceware.org/buildbot/#builders/39/builds/31/steps/16/logs/stdio


^ permalink raw reply	[flat|nested] 41+ messages in thread

* Re: ☠ Buildbot (GNU Toolchain): elfutils - failed test (failure) (master)
  2022-05-14 15:34 builder
@ 2022-05-14 16:40 ` Mark Wielaard
  0 siblings, 0 replies; 41+ messages in thread
From: Mark Wielaard @ 2022-05-14 16:40 UTC (permalink / raw)
  To: elfutils-devel

Hi,

On Sat, May 14, 2022 at 03:34:43PM +0000, builder--- via Elfutils-devel wrote:
> A new failure has been detected on builder elfutils-debian-armhf while building elfutils.
> 
> Full details are available at:
>     https://builder.sourceware.org/buildbot/#builders/6/builds/27
> 
> Build state: failed test (failure)
> Revision: 0f2c8af3ba82ac54acc63ab7cb068578a6c0d96e
> Worker: debian-armhf
> Build Reason: (unknown)
> Blamelist: Mark Wielaard <mark@klomp.org>
> 
> Steps:
> [...] 
> - 7: make check ( failure )
>     Logs:
>         - stdio: https://builder.sourceware.org/buildbot/#builders/6/builds/27/steps/7/logs/stdio
>         - test-suite.log: https://builder.sourceware.org/buildbot/#builders/6/builds/27/steps/7/logs/test-suite_log

This failed twice today:

FAIL: run-backtrace-native-core.sh
==================================
0xbeff4000	0xbeff5000	linux-vdso.so.1
0xb6fa9000	0xb6fd2974	ld-linux-armhf.so.3
0xb62a7000	0xb6321078	libm.so.6
0xb6322000	0xb642c6ec	libstdc++.so.6
0xb642d000	0xb6442218	librt.so.1
0xb6443000	0xb64550c4	libdl.so.2
0xb6456000	0xb654f33c	libc.so.6
0xb6550000	0xb6574270	libpthread.so.0
0xb6575000	0xb659d134	libgcc_s.so.1
0xb659e000	0xb6a4c0f4	libubsan.so.1
0xb6a4d000	0xb6fa8e30	libasan.so.5
0x4a0000	0x4b27c0	backtrace-child
TID 25528:
# 0 0xb655f526    	__libc_do_syscall
# 1 0xb655e316 - 1	raise
# 2 0x4a1290 - 1	sigusr2
# 3 0x4a1344 - 1	stdarg
# 4 0x4a1378 - 1	backtracegen
# 5 0x4a1382 - 1	start
# 6 0xb6555bbe - 1	start_thread
# 7 0xb64f016c - 1	<null>
TID 25526:
# 0 0xb64ed8d2    	syscall
# 1 0xb6a89adc - 1	__interceptor_pthread_create
/var/lib/buildbot/workers/wildebeest/elfutils-debian-armhf/build/tests/backtrace: dwfl_thread_getframes: no matching address range
/var/lib/buildbot/workers/wildebeest/elfutils-debian-armhf/build/tests/backtrace: dwfl_thread_getframes: No DWARF information found
backtrace: backtrace.c:81: callback_verify: Assertion `seen_main' failed.
./test-subr.sh: line 84: 25578 Aborted                 LD_LIBRARY_PATH="${built_library_path}${LD_LIBRARY_PATH:+:}$LD_LIBRARY_PATH" $VALGRIND_CMD "$@"
/var/lib/buildbot/workers/wildebeest/elfutils-debian-armhf/build/tests/backtrace: dwfl_thread_getframes: No DWARF information found
backtrace-child-core.25526: arm needs debuginfo installed for all libraries
rmdir: failed to remove 'test-25518': Directory not empty
FAIL run-backtrace-native-core.sh (exit status: 1)

And once last week. Sadly I don't know why. If this test keep being
flaky on armhf then we might have to disable it.

Since this seems to be compiled with ubsan and asan I installed the
libasan5-dbg and libasan5-dbg packages. Maybe that helps.

Cheers,

Mark


^ permalink raw reply	[flat|nested] 41+ messages in thread

* ☠ Buildbot (GNU Toolchain): elfutils - failed test (failure) (master)
@ 2022-05-14 15:34 builder
  2022-05-14 16:40 ` Mark Wielaard
  0 siblings, 1 reply; 41+ messages in thread
From: builder @ 2022-05-14 15:34 UTC (permalink / raw)
  To: elfutils-devel

A new failure has been detected on builder elfutils-debian-armhf while building elfutils.

Full details are available at:
    https://builder.sourceware.org/buildbot/#builders/6/builds/27

Build state: failed test (failure)
Revision: 0f2c8af3ba82ac54acc63ab7cb068578a6c0d96e
Worker: debian-armhf
Build Reason: (unknown)
Blamelist: Mark Wielaard <mark@klomp.org>

Steps:

- 0: worker_preparation ( success )

- 1: set package name ( success )

- 2: git checkout ( success )
    Logs:
        - stdio: https://builder.sourceware.org/buildbot/#builders/6/builds/27/steps/2/logs/stdio

- 3: autoreconf ( success )
    Logs:
        - stdio: https://builder.sourceware.org/buildbot/#builders/6/builds/27/steps/3/logs/stdio

- 4: configure ( success )
    Logs:
        - stdio: https://builder.sourceware.org/buildbot/#builders/6/builds/27/steps/4/logs/stdio

- 5: get version ( success )
    Logs:
        - stdio: https://builder.sourceware.org/buildbot/#builders/6/builds/27/steps/5/logs/stdio
        - property changes: https://builder.sourceware.org/buildbot/#builders/6/builds/27/steps/5/logs/property_changes

- 6: make ( warnings )
    Logs:
        - stdio: https://builder.sourceware.org/buildbot/#builders/6/builds/27/steps/6/logs/stdio
        - warnings (3): https://builder.sourceware.org/buildbot/#builders/6/builds/27/steps/6/logs/warnings__3_

- 7: make check ( failure )
    Logs:
        - stdio: https://builder.sourceware.org/buildbot/#builders/6/builds/27/steps/7/logs/stdio
        - test-suite.log: https://builder.sourceware.org/buildbot/#builders/6/builds/27/steps/7/logs/test-suite_log

- 8: prep ( success )
    Logs:
        - stdio: https://builder.sourceware.org/buildbot/#builders/6/builds/27/steps/8/logs/stdio

- 9: fetch ['tests/*.trs', 'tests/*.log'] ( success )
    Logs:
        - stdio: https://builder.sourceware.org/buildbot/#builders/6/builds/27/steps/9/logs/stdio

- 10: fetch ['elfutils-*/_build/sub/tests/*.trs', 'elfut ( skipped )
    Logs:
        - stdio: https://builder.sourceware.org/buildbot/#builders/6/builds/27/steps/10/logs/stdio

- 11: fetch ['config.log'] ( success )
    Logs:
        - stdio: https://builder.sourceware.org/buildbot/#builders/6/builds/27/steps/11/logs/stdio

- 12: fetch ['elfutils-*/_build/sub/config.log'] ( skipped )
    Logs:
        - stdio: https://builder.sourceware.org/buildbot/#builders/6/builds/27/steps/12/logs/stdio

- 13: pass .bunsen.source.gitname ( success )
    Logs:
        - stdio: https://builder.sourceware.org/buildbot/#builders/6/builds/27/steps/13/logs/stdio

- 14: pass .bunsen.source.gitrepo ( success )
    Logs:
        - stdio: https://builder.sourceware.org/buildbot/#builders/6/builds/27/steps/14/logs/stdio

- 15: upload to bunsen ( success )
    Logs:
        - stdio: https://builder.sourceware.org/buildbot/#builders/6/builds/27/steps/15/logs/stdio

- 16: clean up ( success )
    Logs:
        - stdio: https://builder.sourceware.org/buildbot/#builders/6/builds/27/steps/16/logs/stdio


^ permalink raw reply	[flat|nested] 41+ messages in thread

* ☠ Buildbot (GNU Toolchain): elfutils - failed test (failure) (master)
@ 2022-05-14 14:42 builder
  0 siblings, 0 replies; 41+ messages in thread
From: builder @ 2022-05-14 14:42 UTC (permalink / raw)
  To: elfutils-devel

A new failure has been detected on builder elfutils-debian-armhf while building elfutils.

Full details are available at:
    https://builder.sourceware.org/buildbot/#builders/6/builds/25

Build state: failed test (failure)
Revision: 4a13bd2cf82a401cbe5850fe9a8bd3fcb5b13bfb
Worker: debian-armhf
Build Reason: (unknown)
Blamelist: Mark Wielaard <mark@klomp.org>

Steps:

- 0: worker_preparation ( success )

- 1: set package name ( success )

- 2: git checkout ( success )
    Logs:
        - stdio: https://builder.sourceware.org/buildbot/#builders/6/builds/25/steps/2/logs/stdio

- 3: autoreconf ( success )
    Logs:
        - stdio: https://builder.sourceware.org/buildbot/#builders/6/builds/25/steps/3/logs/stdio

- 4: configure ( success )
    Logs:
        - stdio: https://builder.sourceware.org/buildbot/#builders/6/builds/25/steps/4/logs/stdio

- 5: get version ( success )
    Logs:
        - stdio: https://builder.sourceware.org/buildbot/#builders/6/builds/25/steps/5/logs/stdio
        - property changes: https://builder.sourceware.org/buildbot/#builders/6/builds/25/steps/5/logs/property_changes

- 6: make ( warnings )
    Logs:
        - stdio: https://builder.sourceware.org/buildbot/#builders/6/builds/25/steps/6/logs/stdio
        - warnings (3): https://builder.sourceware.org/buildbot/#builders/6/builds/25/steps/6/logs/warnings__3_

- 7: make check ( failure )
    Logs:
        - stdio: https://builder.sourceware.org/buildbot/#builders/6/builds/25/steps/7/logs/stdio
        - test-suite.log: https://builder.sourceware.org/buildbot/#builders/6/builds/25/steps/7/logs/test-suite_log

- 8: prep ( success )
    Logs:
        - stdio: https://builder.sourceware.org/buildbot/#builders/6/builds/25/steps/8/logs/stdio

- 9: fetch ['tests/*.trs', 'tests/*.log'] ( success )
    Logs:
        - stdio: https://builder.sourceware.org/buildbot/#builders/6/builds/25/steps/9/logs/stdio

- 10: fetch ['elfutils-*/_build/sub/tests/*.trs', 'elfut ( skipped )
    Logs:
        - stdio: https://builder.sourceware.org/buildbot/#builders/6/builds/25/steps/10/logs/stdio

- 11: fetch ['config.log'] ( success )
    Logs:
        - stdio: https://builder.sourceware.org/buildbot/#builders/6/builds/25/steps/11/logs/stdio

- 12: fetch ['elfutils-*/_build/sub/config.log'] ( skipped )
    Logs:
        - stdio: https://builder.sourceware.org/buildbot/#builders/6/builds/25/steps/12/logs/stdio

- 13: pass .bunsen.source.gitname ( success )
    Logs:
        - stdio: https://builder.sourceware.org/buildbot/#builders/6/builds/25/steps/13/logs/stdio

- 14: pass .bunsen.source.gitrepo ( success )
    Logs:
        - stdio: https://builder.sourceware.org/buildbot/#builders/6/builds/25/steps/14/logs/stdio

- 15: upload to bunsen ( success )
    Logs:
        - stdio: https://builder.sourceware.org/buildbot/#builders/6/builds/25/steps/15/logs/stdio

- 16: clean up ( success )
    Logs:
        - stdio: https://builder.sourceware.org/buildbot/#builders/6/builds/25/steps/16/logs/stdio


^ permalink raw reply	[flat|nested] 41+ messages in thread

* Re: ☠ Buildbot (GNU Toolchain): elfutils - failed test (failure) (master)
  2022-05-04 15:34 builder
@ 2022-05-04 17:44 ` Mark Wielaard
  0 siblings, 0 replies; 41+ messages in thread
From: Mark Wielaard @ 2022-05-04 17:44 UTC (permalink / raw)
  To: builder; +Cc: Frank Ch. Eigler, elfutils-devel

Hi,

On Wed, May 04, 2022 at 03:34:44PM +0000, builder--- via Elfutils-devel wrote:
> A new failure has been detected on builder elfutils-debian-armhf while building elfutils.
> 
> Full details are available at:
>     https://builder.sourceware.org/buildbot/#builders/6/builds/17
> 
> Build state: failed test (failure)
> Revision: 59158656f3b0b99d8784ddc82c15778813000edc
> Worker: debian-armhf
> Build Reason: (unknown)
> Blamelist: Frank Ch. Eigler <fche@redhat.com>

Hmmmm.... This seems totally unrelated to that commit

> - 7: make check ( failure )
>     Logs:
>         - stdio: https://builder.sourceware.org/buildbot/#builders/6/builds/17/steps/7/logs/stdio
>         - test-suite.log: https://builder.sourceware.org/buildbot/#builders/6/builds/17/steps/7/logs/test-suite_log

FAIL: run-backtrace-native-core.sh
==================================
0xbeb25000	0xbeb26000	linux-vdso.so.1
0xb6f70000	0xb6f99974	ld-linux-armhf.so.3
0xb626e000	0xb62e8078	libm.so.6
0xb62e9000	0xb63f36ec	libstdc++.so.6
0xb63f4000	0xb6409218	librt.so.1
0xb640a000	0xb641c0c4	libdl.so.2
0xb641d000	0xb651633c	libc.so.6
0xb6517000	0xb653b270	libpthread.so.0
0xb653c000	0xb6564134	libgcc_s.so.1
0xb6565000	0xb6a130f4	libubsan.so.1
0xb6a14000	0xb6f6fe30	libasan.so.5
0x410000	0x4227c0	backtrace-child
TID 25080:
# 0 0xb6526526    	__libc_do_syscall
# 1 0xb6525316 - 1	raise
# 2 0x411290 - 1	sigusr2
# 3 0x411344 - 1	stdarg
# 4 0x411378 - 1	backtracegen
# 5 0x411382 - 1	start
# 6 0xb651cbbe - 1	start_thread
# 7 0xb64b716c - 1	<null>
TID 25076:
# 0 0xb64b48d2    	syscall
# 1 0xb6a50adc - 1	__interceptor_pthread_create
/var/lib/buildbot/workers/wildebeest/elfutils-debian-armhf/build/tests/backtrace: dwfl_thread_getframes: no matching address range
/var/lib/buildbot/workers/wildebeest/elfutils-debian-armhf/build/tests/backtrace: dwfl_thread_getframes: No DWARF information found
backtrace: backtrace.c:81: callback_verify: Assertion `seen_main' failed.
./test-subr.sh: line 84: 25096 Aborted                 LD_LIBRARY_PATH="${built_library_path}${LD_LIBRARY_PATH:+:}$LD_LIBRARY_PATH" $VALGRIND_CMD "$@"
/var/lib/buildbot/workers/wildebeest/elfutils-debian-armhf/build/tests/backtrace: dwfl_thread_getframes: No DWARF information found
backtrace-child-core.25076: arm needs debuginfo installed for all libraries
rmdir: failed to remove 'test-25065': Directory not empty
FAIL run-backtrace-native-core.sh (exit status: 1)

I wonder if this is caused by the asan or ubsan "interceptor". But if
so, why haven't we seen this before?

Cheers,

Mark

^ permalink raw reply	[flat|nested] 41+ messages in thread

* ☠ Buildbot (GNU Toolchain): elfutils - failed test (failure) (master)
@ 2022-05-04 15:34 builder
  2022-05-04 17:44 ` Mark Wielaard
  0 siblings, 1 reply; 41+ messages in thread
From: builder @ 2022-05-04 15:34 UTC (permalink / raw)
  To: Frank Ch. Eigler; +Cc: elfutils-devel

A new failure has been detected on builder elfutils-debian-armhf while building elfutils.

Full details are available at:
    https://builder.sourceware.org/buildbot/#builders/6/builds/17

Build state: failed test (failure)
Revision: 59158656f3b0b99d8784ddc82c15778813000edc
Worker: debian-armhf
Build Reason: (unknown)
Blamelist: Frank Ch. Eigler <fche@redhat.com>

Steps:

- 0: worker_preparation ( success )

- 1: set package name ( success )

- 2: git checkout ( success )
    Logs:
        - stdio: https://builder.sourceware.org/buildbot/#builders/6/builds/17/steps/2/logs/stdio

- 3: autoreconf ( success )
    Logs:
        - stdio: https://builder.sourceware.org/buildbot/#builders/6/builds/17/steps/3/logs/stdio

- 4: configure ( success )
    Logs:
        - stdio: https://builder.sourceware.org/buildbot/#builders/6/builds/17/steps/4/logs/stdio

- 5: get version ( success )
    Logs:
        - stdio: https://builder.sourceware.org/buildbot/#builders/6/builds/17/steps/5/logs/stdio
        - property changes: https://builder.sourceware.org/buildbot/#builders/6/builds/17/steps/5/logs/property_changes

- 6: make ( warnings )
    Logs:
        - stdio: https://builder.sourceware.org/buildbot/#builders/6/builds/17/steps/6/logs/stdio
        - warnings (3): https://builder.sourceware.org/buildbot/#builders/6/builds/17/steps/6/logs/warnings__3_

- 7: make check ( failure )
    Logs:
        - stdio: https://builder.sourceware.org/buildbot/#builders/6/builds/17/steps/7/logs/stdio
        - test-suite.log: https://builder.sourceware.org/buildbot/#builders/6/builds/17/steps/7/logs/test-suite_log

- 8: prep ( success )
    Logs:
        - stdio: https://builder.sourceware.org/buildbot/#builders/6/builds/17/steps/8/logs/stdio

- 9: fetch ['tests/*.trs', 'tests/*.log'] ( success )
    Logs:
        - stdio: https://builder.sourceware.org/buildbot/#builders/6/builds/17/steps/9/logs/stdio

- 10: fetch ['elfutils-*/_build/sub/tests/*.trs', 'elfut ( skipped )
    Logs:
        - stdio: https://builder.sourceware.org/buildbot/#builders/6/builds/17/steps/10/logs/stdio

- 11: fetch ['config.log'] ( success )
    Logs:
        - stdio: https://builder.sourceware.org/buildbot/#builders/6/builds/17/steps/11/logs/stdio

- 12: fetch ['elfutils-*/_build/sub/config.log'] ( skipped )
    Logs:
        - stdio: https://builder.sourceware.org/buildbot/#builders/6/builds/17/steps/12/logs/stdio

- 13: pass .bunsen.source.gitname ( success )
    Logs:
        - stdio: https://builder.sourceware.org/buildbot/#builders/6/builds/17/steps/13/logs/stdio

- 14: pass .bunsen.source.gitrepo ( success )
    Logs:
        - stdio: https://builder.sourceware.org/buildbot/#builders/6/builds/17/steps/14/logs/stdio

- 15: upload to bunsen ( success )
    Logs:
        - stdio: https://builder.sourceware.org/buildbot/#builders/6/builds/17/steps/15/logs/stdio

- 16: clean up ( success )
    Logs:
        - stdio: https://builder.sourceware.org/buildbot/#builders/6/builds/17/steps/16/logs/stdio


^ permalink raw reply	[flat|nested] 41+ messages in thread

* ☠ Buildbot (GNU Toolchain): elfutils - failed test (failure) (master)
@ 2022-04-23 13:19 builder
  0 siblings, 0 replies; 41+ messages in thread
From: builder @ 2022-04-23 13:19 UTC (permalink / raw)
  To: Frank Ch. Eigler; +Cc: elfutils-devel

A new failure has been detected on builder elfutils-fedora-x86_64 while building elfutils.

Full details are available at:
    http://localhost:8010/#builders/30/builds/28

Build state: failed test (failure)
Revision: 40508c282202b5ff85201d79dc8d32298bb27299
Worker: fedora-x86_64
Build Reason: (unknown)
Blamelist: Frank Ch. Eigler <fche@redhat.com>

Steps:

- 0: worker_preparation ( success )

- 1: set package name ( success )

- 2: git checkout ( success )
    Logs:
        - stdio: http://localhost:8010/#builders/30/builds/28/steps/2/logs/stdio

- 3: autoreconf ( success )
    Logs:
        - stdio: http://localhost:8010/#builders/30/builds/28/steps/3/logs/stdio

- 4: configure ( success )
    Logs:
        - stdio: http://localhost:8010/#builders/30/builds/28/steps/4/logs/stdio

- 5: get version ( success )
    Logs:
        - stdio: http://localhost:8010/#builders/30/builds/28/steps/5/logs/stdio
        - property changes: http://localhost:8010/#builders/30/builds/28/steps/5/logs/property_changes

- 6: make ( warnings )
    Logs:
        - stdio: http://localhost:8010/#builders/30/builds/28/steps/6/logs/stdio
        - warnings (3): http://localhost:8010/#builders/30/builds/28/steps/6/logs/warnings__3_

- 7: make check ( success )
    Logs:
        - stdio: http://localhost:8010/#builders/30/builds/28/steps/7/logs/stdio
        - test-suite.log: http://localhost:8010/#builders/30/builds/28/steps/7/logs/test-suite_log

- 8: make distcheck ( failure )
    Logs:
        - stdio: http://localhost:8010/#builders/30/builds/28/steps/8/logs/stdio
        - test-suite.log: http://localhost:8010/#builders/30/builds/28/steps/8/logs/test-suite_log
        - warnings (4): http://localhost:8010/#builders/30/builds/28/steps/8/logs/warnings__4_


^ permalink raw reply	[flat|nested] 41+ messages in thread

* Re: ☠ Buildbot (GNU Toolchain): elfutils - failed test (failure) (master)
  2022-04-23  1:19 builder
@ 2022-04-23  1:31 ` Mark Wielaard
  0 siblings, 0 replies; 41+ messages in thread
From: Mark Wielaard @ 2022-04-23  1:31 UTC (permalink / raw)
  To: builder; +Cc: наб via Elfutils-devel

[-- Attachment #1: Type: text/plain, Size: 1016 bytes --]

On Sat, Apr 23, 2022 at 01:19:53AM +0000, builder--- via Elfutils-devel wrote:
> A new failure has been detected on builder elfutils-debian-ppc64 while building elfutils.
> 
> Full details are available at:
>     https://builder.sourceware.org/buildbot/#builders/63/builds/4
> 
> Build state: failed test (failure)
> Revision: 7b046b7c060acc32c00748ee66ac350f77bc6571
> Worker: debian-ppc64
> Build Reason: (unknown)
> Blamelist: наб via Elfutils-devel <elfutils-devel@sourceware.org>
> 
> Steps:
> [...]
> - 7: make check ( failure )
>     Logs:
>         - stdio: https://builder.sourceware.org/buildbot/#builders/63/builds/4/steps/7/logs/stdio
>         - test-suite.log: https://builder.sourceware.org/buildbot/#builders/63/builds/4/steps/7/logs/test-suite_log

Gah. It is run-debuginfod-webapi-concurrency.sh again with
error_count{libmicrohttpd="Server reached connection limit.
Closing inbound connection.\n"} 9

I guess 100 parallel lookups really is too much. I am going to lower
it to 64.

Cheers,

Mark

[-- Attachment #2: 0001-tests-Lower-parallel-lookups-in-run-debuginfod-webap.patch --]
[-- Type: text/x-diff, Size: 1851 bytes --]

From 318807e7f968fd70b80408e3df029c04365c47d8 Mon Sep 17 00:00:00 2001
From: Mark Wielaard <mark@klomp.org>
Date: Sat, 23 Apr 2022 03:20:17 +0200
Subject: [PATCH] tests: Lower parallel lookups in
 run-debuginfod-webapi-concurrency.sh

With 100 parallel lookups we sometimes see:
Server reached connection limit. Closing inbound connection.

Lower parallel lookups to 64

Signed-off-by: Mark Wielaard <mark@klomp.org>
---
 tests/ChangeLog                            | 4 ++++
 tests/run-debuginfod-webapi-concurrency.sh | 7 ++++---
 2 files changed, 8 insertions(+), 3 deletions(-)

diff --git a/tests/ChangeLog b/tests/ChangeLog
index c734b260..2286f53f 100644
--- a/tests/ChangeLog
+++ b/tests/ChangeLog
@@ -1,3 +1,7 @@
+2022-04-23  Mark Wielaard  <mark@klomp.org>
+
+	* run-debuginfod-webapi-concurrency.sh: Lower parallel lookups.
+
 2022-03-01  Di Chen <dichen@redhat.com>
 
 	* alldts.c (dtflags): Put DT_NULL last.
diff --git a/tests/run-debuginfod-webapi-concurrency.sh b/tests/run-debuginfod-webapi-concurrency.sh
index 402a6307..4928f6d0 100755
--- a/tests/run-debuginfod-webapi-concurrency.sh
+++ b/tests/run-debuginfod-webapi-concurrency.sh
@@ -47,12 +47,13 @@ do
     wait_ready $PORT1 'thread_busy{role="scan"}' 0
 
     # Do a bunch of lookups in parallel
-    for jobs in `seq 100`; do
+    lookup_nr=64
+    for jobs in `seq $lookup_nr`; do
         curl -s http://localhost:$PORT1/buildid/cee13b2ea505a7f37bd20d271c6bc7e5f8d2dfcb/debuginfo > /dev/null &
     done
 
-    # all 100 curls should succeed
-    wait_ready $PORT1 'http_responses_transfer_bytes_count{code="200",type="debuginfo"}' 100
+    # all curls should succeed
+    wait_ready $PORT1 'http_responses_transfer_bytes_count{code="200",type="debuginfo"}' $lookup_nr
     
     (sleep 5;
      curl -s http://localhost:$PORT1/metrics | egrep 'error|responses';
-- 
2.30.2


^ permalink raw reply	[flat|nested] 41+ messages in thread

* ☠ Buildbot (GNU Toolchain): elfutils - failed test (failure) (master)
@ 2022-04-23  1:19 builder
  2022-04-23  1:31 ` Mark Wielaard
  0 siblings, 1 reply; 41+ messages in thread
From: builder @ 2022-04-23  1:19 UTC (permalink / raw)
  To: наб via Elfutils-devel; +Cc: elfutils-devel

A new failure has been detected on builder elfutils-debian-ppc64 while building elfutils.

Full details are available at:
    https://builder.sourceware.org/buildbot/#builders/63/builds/4

Build state: failed test (failure)
Revision: 7b046b7c060acc32c00748ee66ac350f77bc6571
Worker: debian-ppc64
Build Reason: (unknown)
Blamelist: наб via Elfutils-devel <elfutils-devel@sourceware.org>

Steps:

- 0: worker_preparation ( success )

- 1: set package name ( success )

- 2: git checkout ( success )
    Logs:
        - stdio: https://builder.sourceware.org/buildbot/#builders/63/builds/4/steps/2/logs/stdio

- 3: autoreconf ( success )
    Logs:
        - stdio: https://builder.sourceware.org/buildbot/#builders/63/builds/4/steps/3/logs/stdio

- 4: configure ( success )
    Logs:
        - stdio: https://builder.sourceware.org/buildbot/#builders/63/builds/4/steps/4/logs/stdio

- 5: get version ( success )
    Logs:
        - stdio: https://builder.sourceware.org/buildbot/#builders/63/builds/4/steps/5/logs/stdio
        - property changes: https://builder.sourceware.org/buildbot/#builders/63/builds/4/steps/5/logs/property_changes

- 6: make ( warnings )
    Logs:
        - stdio: https://builder.sourceware.org/buildbot/#builders/63/builds/4/steps/6/logs/stdio
        - warnings (3): https://builder.sourceware.org/buildbot/#builders/63/builds/4/steps/6/logs/warnings__3_

- 7: make check ( failure )
    Logs:
        - stdio: https://builder.sourceware.org/buildbot/#builders/63/builds/4/steps/7/logs/stdio
        - test-suite.log: https://builder.sourceware.org/buildbot/#builders/63/builds/4/steps/7/logs/test-suite_log


^ permalink raw reply	[flat|nested] 41+ messages in thread

* Re: ☠ Buildbot (GNU Toolchain): elfutils - failed test (failure) (master)
  2022-04-19  9:05 builder
@ 2022-04-19  9:28 ` Mark Wielaard
  0 siblings, 0 replies; 41+ messages in thread
From: Mark Wielaard @ 2022-04-19  9:28 UTC (permalink / raw)
  To: builder; +Cc: Di Chen, elfutils-devel

[-- Attachment #1: Type: text/plain, Size: 4214 bytes --]

Hi,

On Tue, Apr 19, 2022 at 09:05:22AM +0000, builder--- via Elfutils-devel wrote:
> A new failure has been detected on builder elfutils-debian-armhf while building elfutils.
> 
> Full details are available at:
>     https://builder.sourceware.org/buildbot/#builders/6/builds/3
> 
> Build state: failed test (failure)
> Revision: 5b497d8da4920bf7b63a4aa3752cf580b3ad654c
> Worker: debian-armhf
> Build Reason: (unknown)
> Blamelist: Di Chen <dichen@redhat.com>
> [...]
> - 7: make check ( failure )
>     Logs:
>         - stdio: https://builder.sourceware.org/buildbot/#builders/6/builds/3/steps/7/logs/stdio
>         - test-suite.log: https://builder.sourceware.org/buildbot/#builders/6/builds/3/steps/7/logs/test-suite_log
> [...]
> A new failure has been detected on builder elfutils-debian-i386 while building elfutils.
> 
> Full details are available at:
>     https://builder.sourceware.org/buildbot/#builders/17/builds/2
> 
> Build state: failed test (failure)
> Revision: 5b497d8da4920bf7b63a4aa3752cf580b3ad654c
> Worker: debian-i386
> Build Reason: (unknown)
> Blamelist: Di Chen <dichen@redhat.com>
> [...]
> - 7: make check ( failure )
>     Logs:
>         - stdio: https://builder.sourceware.org/buildbot/#builders/17/builds/2/steps/7/logs/stdio
>         - test-suite.log: https://builder.sourceware.org/buildbot/#builders/17/builds/2/steps/7/logs/test-suite_log

These are interesting failures:

==28027==ERROR: AddressSanitizer: stack-use-after-scope on address 0xbef24d60 at pc 0x004d9a6f bp 0xbef24c38 sp 0xbef24c3c
READ of size 8 at 0xbef24d60 thread T0
    #0 0x4d9a6d in get_dyn_ents /var/lib/buildbot/workers/wildebeest/elfutils-debian-armhf/build/src/readelf.c:1787
    #1 0x4d9a6d in handle_dynamic /var/lib/buildbot/workers/wildebeest/elfutils-debian-armhf/build/src/readelf.c:1810
    #2 0x4fcc75 in print_dynamic /var/lib/buildbot/workers/wildebeest/elfutils-debian-armhf/build/src/readelf.c:1946
    #3 0x4fcc75 in process_elf_file /var/lib/buildbot/workers/wildebeest/elfutils-debian-armhf/build/src/readelf.c:1008
    #4 0x5001c1 in process_dwflmod /var/lib/buildbot/workers/wildebeest/elfutils-debian-armhf/build/src/readelf.c:792
    #5 0xb67fd7ad in dwfl_getmodules /var/lib/buildbot/workers/wildebeest/elfutils-debian-armhf/build/libdwfl/dwfl_getmodules.c:86
    #6 0x4e352f in process_file /var/lib/buildbot/workers/wildebeest/elfutils-debian-armhf/build/src/readelf.c:900
    #7 0x4d3c2b in main /var/lib/buildbot/workers/wildebeest/elfutils-debian-armhf/build/src/readelf.c:372
    #8 0xb5fde523 in __libc_start_main /build/glibc-RK4xiD/glibc-2.28/csu/libc-start.c:308
Address 0xbef24d60 is located in stack of thread T0 at offset 160 in frame
    #0 0x4d8f83 in handle_dynamic /var/lib/buildbot/workers/wildebeest/elfutils-debian-armhf/build/src/readelf.c:1795
  This frame has 5 object(s):
    [32, 36) 'shstrndx'
    [96, 112) 'dynmem'
    [160, 176) 'dyn_mem' <== Memory access at offset 160 is inside this variable
    [224, 288) 'glink_mem'
    [320, 384) 'buf'
HINT: this may be a false positive if your program uses some custom stack unwind mechanism or swapcontext
      (longjmp and C++ exceptions *are* supported)
SUMMARY: AddressSanitizer: stack-use-after-scope /var/lib/buildbot/workers/wildebeest/elfutils-debian-armhf/build/src/readelf.c:1787 in get_dyn_ents

I think they are not real bugs, or the valgrind builders would have
picked them up. But the are theoretically issues since a compiler
could optimize its stack usage to make this an issue.

static size_t 
get_dyn_ents (Elf_Data * dyn_data)
{
  GElf_Dyn *dyn;
  GElf_Dyn dyn_mem;
  size_t dyn_idx = 0;
  do
    {
      GElf_Dyn dyn_mem;
      dyn = gelf_getdyn(dyn_data, dyn_idx, &dyn_mem);
      if (dyn != NULL)
        ++dyn_idx;
    }
  while (dyn != NULL && dyn->d_tag != DT_NULL);

  return dyn_idx;
}

The issue is dyn pointing to dyn_mem, but dyn_mem being defined inside
the do while loop, while dyn is accessed "outside" it (or more
correctly, in the condition of the do while loop). Technically it
means at that point dyn_mem could have been purged from the
stack. Although unlikely moving the dyn_mem definition outside the
loop should fix it.

I'll push the attached fix.

Cheers,

Mark

[-- Attachment #2: 0001-readelf-Define-dyn_mem-outside-the-while-loop.patch --]
[-- Type: text/x-diff, Size: 1201 bytes --]

From 21fa92319657ca479ae108967fd41ac523a2f876 Mon Sep 17 00:00:00 2001
From: Mark Wielaard <mark@klomp.org>
Date: Tue, 19 Apr 2022 11:25:42 +0200
Subject: [PATCH] readelf: Define dyn_mem outside the while loop.

The GCC address sanitizer might complain otherwise:
stack-use-after-scope src/readelf.c:1787 in get_dyn_ents

Signed-off-by: Mark Wielaard <mark@klomp.org>
---
 src/ChangeLog | 4 ++++
 src/readelf.c | 2 +-
 2 files changed, 5 insertions(+), 1 deletion(-)

diff --git a/src/ChangeLog b/src/ChangeLog
index f563e993..6ef81862 100644
--- a/src/ChangeLog
+++ b/src/ChangeLog
@@ -1,3 +1,7 @@
+2022-04-19  Mark Wielaard  <mark@klomp.org>
+
+	* readelf.c (get_dyn_ents): Define dyn_mem outside the while loop.
+
 2022-03-01  Di Chen  <dichen@redhat.com>
 
 	* readelf.c (get_dyn_ents): New function.
diff --git a/src/readelf.c b/src/readelf.c
index 4b275ece..4b6aab2b 100644
--- a/src/readelf.c
+++ b/src/readelf.c
@@ -1776,10 +1776,10 @@ static size_t
 get_dyn_ents (Elf_Data * dyn_data)
 {
   GElf_Dyn *dyn;
+  GElf_Dyn dyn_mem;
   size_t dyn_idx = 0;
   do
     {
-      GElf_Dyn dyn_mem;
       dyn = gelf_getdyn(dyn_data, dyn_idx, &dyn_mem);
       if (dyn != NULL)
 	++dyn_idx;
-- 
2.30.2


^ permalink raw reply	[flat|nested] 41+ messages in thread

* ☠ Buildbot (GNU Toolchain): elfutils - failed test (failure) (master)
@ 2022-04-19  9:05 builder
  2022-04-19  9:28 ` Mark Wielaard
  0 siblings, 1 reply; 41+ messages in thread
From: builder @ 2022-04-19  9:05 UTC (permalink / raw)
  To: Di Chen; +Cc: elfutils-devel

A new failure has been detected on builder elfutils-debian-armhf while building elfutils.

Full details are available at:
    https://builder.sourceware.org/buildbot/#builders/6/builds/3

Build state: failed test (failure)
Revision: 5b497d8da4920bf7b63a4aa3752cf580b3ad654c
Worker: debian-armhf
Build Reason: (unknown)
Blamelist: Di Chen <dichen@redhat.com>

Steps:

- 0: worker_preparation ( success )

- 1: set package name ( success )

- 2: git checkout ( success )
    Logs:
        - stdio: https://builder.sourceware.org/buildbot/#builders/6/builds/3/steps/2/logs/stdio

- 3: autoreconf ( success )
    Logs:
        - stdio: https://builder.sourceware.org/buildbot/#builders/6/builds/3/steps/3/logs/stdio

- 4: configure ( success )
    Logs:
        - stdio: https://builder.sourceware.org/buildbot/#builders/6/builds/3/steps/4/logs/stdio

- 5: get version ( success )
    Logs:
        - stdio: https://builder.sourceware.org/buildbot/#builders/6/builds/3/steps/5/logs/stdio
        - property changes: https://builder.sourceware.org/buildbot/#builders/6/builds/3/steps/5/logs/property_changes

- 6: make ( warnings )
    Logs:
        - stdio: https://builder.sourceware.org/buildbot/#builders/6/builds/3/steps/6/logs/stdio
        - warnings (3): https://builder.sourceware.org/buildbot/#builders/6/builds/3/steps/6/logs/warnings__3_

- 7: make check ( failure )
    Logs:
        - stdio: https://builder.sourceware.org/buildbot/#builders/6/builds/3/steps/7/logs/stdio
        - test-suite.log: https://builder.sourceware.org/buildbot/#builders/6/builds/3/steps/7/logs/test-suite_log

A new failure has been detected on builder elfutils-debian-i386 while building elfutils.

Full details are available at:
    https://builder.sourceware.org/buildbot/#builders/17/builds/2

Build state: failed test (failure)
Revision: 5b497d8da4920bf7b63a4aa3752cf580b3ad654c
Worker: debian-i386
Build Reason: (unknown)
Blamelist: Di Chen <dichen@redhat.com>

Steps:

- 0: worker_preparation ( success )

- 1: set package name ( success )

- 2: git checkout ( success )
    Logs:
        - stdio: https://builder.sourceware.org/buildbot/#builders/17/builds/2/steps/2/logs/stdio

- 3: autoreconf ( success )
    Logs:
        - stdio: https://builder.sourceware.org/buildbot/#builders/17/builds/2/steps/3/logs/stdio

- 4: configure ( success )
    Logs:
        - stdio: https://builder.sourceware.org/buildbot/#builders/17/builds/2/steps/4/logs/stdio

- 5: get version ( success )
    Logs:
        - stdio: https://builder.sourceware.org/buildbot/#builders/17/builds/2/steps/5/logs/stdio
        - property changes: https://builder.sourceware.org/buildbot/#builders/17/builds/2/steps/5/logs/property_changes

- 6: make ( warnings )
    Logs:
        - stdio: https://builder.sourceware.org/buildbot/#builders/17/builds/2/steps/6/logs/stdio
        - warnings (3): https://builder.sourceware.org/buildbot/#builders/17/builds/2/steps/6/logs/warnings__3_

- 7: make check ( failure )
    Logs:
        - stdio: https://builder.sourceware.org/buildbot/#builders/17/builds/2/steps/7/logs/stdio
        - test-suite.log: https://builder.sourceware.org/buildbot/#builders/17/builds/2/steps/7/logs/test-suite_log


^ permalink raw reply	[flat|nested] 41+ messages in thread

end of thread, other threads:[~2022-11-28 13:30 UTC | newest]

Thread overview: 41+ messages (download: mbox.gz / follow: Atom feed)
-- links below jump to the message on this page --
2022-07-31 23:54 ☠ Buildbot (GNU Toolchain): elfutils - failed test (failure) (master) builder
2022-08-01  0:09 ` Mark Wielaard
2022-08-01  9:13   ` Mark Wielaard
  -- strict thread matches above, loose matches on Subject: below --
2022-11-28 13:30 builder
2022-11-04 22:29 builder
2022-11-03 15:27 builder
2022-11-02 13:39 builder
2022-11-02 14:19 ` Mark Wielaard
2022-11-02  1:15 builder
2022-11-02 12:06 ` Mark Wielaard
2022-11-01 21:28 builder
2022-10-31 13:51 builder
2022-10-27 19:25 builder
2022-10-17 14:59 builder
2022-10-17  9:08 builder
2022-10-17 10:26 ` Mark Wielaard
2022-10-17 11:02   ` Frank Ch. Eigler
2022-10-17 14:09     ` Frank Ch. Eigler
2022-10-16 21:02 builder
2022-10-16 15:47 builder
2022-10-16 16:26 ` Mark Wielaard
2022-10-13 16:51 builder
2022-09-14 19:36 builder
2022-05-28  9:15 builder
2022-05-28  9:35 ` Mark Wielaard
2022-05-28  9:43   ` Mark Wielaard
2022-06-02 15:44     ` Mark Wielaard
2022-05-27 16:02 builder
2022-05-27 22:30 ` Mark Wielaard
2022-05-28  2:34   ` Frank Ch. Eigler
2022-05-28  9:04     ` Mark Wielaard
2022-05-14 15:34 builder
2022-05-14 16:40 ` Mark Wielaard
2022-05-14 14:42 builder
2022-05-04 15:34 builder
2022-05-04 17:44 ` Mark Wielaard
2022-04-23 13:19 builder
2022-04-23  1:19 builder
2022-04-23  1:31 ` Mark Wielaard
2022-04-19  9:05 builder
2022-04-19  9:28 ` Mark Wielaard

This is a public inbox, see mirroring instructions
for how to clone and mirror all data and code used for this inbox;
as well as URLs for read-only IMAP folder(s) and NNTP newsgroup(s).