public inbox for binutils@sourceware.org
 help / color / mirror / Atom feed
* ☠ Buildbot (Sourceware): binutils-gdb - failed compile (failure) (master)
@ 2023-08-18 17:45 builder
  0 siblings, 0 replies; 29+ messages in thread
From: builder @ 2023-08-18 17:45 UTC (permalink / raw)
  To: binutils

A new failure has been detected on builder binutils-debian-armhf while building binutils-gdb.

Full details are available at:
    https://builder.sourceware.org/buildbot/#builders/80/builds/1911

Build state: failed compile (failure)
Revision: 6e712424f5cb1f01acf41c21f8721ee028c2a20c
Worker: debian-armhf
Build Reason: (unknown)
Blamelist: Paul Iannetta <piannetta@kalrayinc.com>

Steps:

- 0: worker_preparation ( success )

- 1: git checkout ( success )
    Logs:
        - stdio: https://builder.sourceware.org/buildbot/#builders/80/builds/1911/steps/1/logs/stdio

- 2: rm -rf binutils-build ( success )
    Logs:
        - stdio: https://builder.sourceware.org/buildbot/#builders/80/builds/1911/steps/2/logs/stdio

- 3: configure ( success )
    Logs:
        - stdio: https://builder.sourceware.org/buildbot/#builders/80/builds/1911/steps/3/logs/stdio
        - config.log: https://builder.sourceware.org/buildbot/#builders/80/builds/1911/steps/3/logs/config_log

- 4: make ( failure )
    Logs:
        - stdio: https://builder.sourceware.org/buildbot/#builders/80/builds/1911/steps/4/logs/stdio
        - warnings (23): https://builder.sourceware.org/buildbot/#builders/80/builds/1911/steps/4/logs/warnings__23_


^ permalink raw reply	[flat|nested] 29+ messages in thread

* ☠ Buildbot (Sourceware): binutils-gdb - failed compile (failure) (master)
@ 2024-01-29 19:38 builder
  0 siblings, 0 replies; 29+ messages in thread
From: builder @ 2024-01-29 19:38 UTC (permalink / raw)
  To: binutils

A new failure has been detected on builder binutils-debian-armhf while building binutils-gdb.

Full details are available at:
    https://builder.sourceware.org/buildbot/#/builders/80/builds/2500

Build state: failed compile (failure)
Revision: 0c45feb159a14ca4cb50cfbf45eacaf5a6cecf2b
Worker: debian-armhf
Build Reason: (unknown)
Blamelist: Aaron Merey <amerey@redhat.com>, Aditya Vidyadhar Kamath <Aditya.Kamath1@ibm.com>, Alan Modra <amodra@gmail.com>, Andrew Burgess <aburgess@redhat.com>, Andrew Carlotti <andrew.carlotti@arm.com>, Cui, Lili <lili.cui@intel.com>, Cupertino Miranda <cupertino.miranda@oracle.com>, David Faust <david.faust@oracle.com>, Dimitar Dimitrov <dimitar@dinux.eu>, GDB Administrator <gdbadmin@sourceware.org>, Guinevere Larsen <blarsen@redhat.com>, H.J. Lu <hjl.tools@gmail.com>, Hannes Domani <ssbssa@yahoo.de>, Hu, Lin1 <lin1.hu@intel.com>, Indu Bhagat <indu.bhagat@oracle.com>, Jan Beulich <jbeulich@suse.com>, Jaydeep Patil <jaydeep.patil@imgtec.com>, Jin Ma <jinma@linux.alibaba.com>, Jose E. Marchesi <jose.marchesi@oracle.com>, Joseph Myers <josmyers@redhat.com>, Lancelot SIX <lancelot.six@amd.com>, Lulu Cai <cailulu@loongson.cn>, Mark Wielaard <mark@klomp.org>, Mike Frysinger <vapier@gentoo.org>, Nick Clifton <nickc@redhat.com>, Oleg Tolmatcev <oleg.tolmatcev@gmail.com>, Paul Iannetta <piannetta@kalrayinc.com>, Samuel Tardieu <sam@rfc1149.net>, Saurabh Jha <saurabh.jha@arm.com>, Sergey Bugaev <bugaevc@gmail.com>, Simon Marchi <simon.marchi@efficios.com>, Srinath Parvathaneni <srinath.parvathaneni@arm.com>, Tamar Christina <tamar.christina@arm.com>, Tatsuyuki Ishi <ishitatsuyuki@gmail.com>, Tejas Joshi <TejasSanjay.Joshi@amd.com>, Thiago Jung Bauermann <thiago.bauermann@linaro.org>, Tom Tromey <tom@tromey.com>, Tom Tromey <tromey@adacore.com>, Tom de Vries <tdevries@suse.de>, Victor Do Nascimento <victor.donascimento@arm.com>, Vladimir Mezentsev <vladimir.mezentsev@oracle.com>, Xi Ruoyao <xry111@xry111.site>, Yang Liu <liuyang22@iscas.ac.cn>, YunQiang Su <yunqiang.su@cipunited.com>, changjiachen <changjiachen@stu.xupt.edu.cn>, mengqinggang <mengqinggang@loongson.cn>, srinath <srinath.parvathaneni@arm.com>, Сергей Чернов <klen_s@mail.ru>

Steps:

- 0: worker_preparation ( success )

- 1: git checkout ( success )
    Logs:
        - stdio: https://builder.sourceware.org/buildbot/#/builders/80/builds/2500/steps/1/logs/stdio

- 2: rm -rf binutils-build ( success )
    Logs:
        - stdio: https://builder.sourceware.org/buildbot/#/builders/80/builds/2500/steps/2/logs/stdio

- 3: configure ( success )
    Logs:
        - stdio: https://builder.sourceware.org/buildbot/#/builders/80/builds/2500/steps/3/logs/stdio
        - config.log: https://builder.sourceware.org/buildbot/#/builders/80/builds/2500/steps/3/logs/config_log

- 4: make ( failure )
    Logs:
        - stdio: https://builder.sourceware.org/buildbot/#/builders/80/builds/2500/steps/4/logs/stdio
        - warnings (15): https://builder.sourceware.org/buildbot/#/builders/80/builds/2500/steps/4/logs/warnings__15_


^ permalink raw reply	[flat|nested] 29+ messages in thread

* ☠ Buildbot (Sourceware): binutils-gdb - failed compile (failure) (master)
@ 2024-01-22  0:59 builder
  0 siblings, 0 replies; 29+ messages in thread
From: builder @ 2024-01-22  0:59 UTC (permalink / raw)
  To: binutils

A new failure has been detected on builder binutils-rawhide-x86_64 while building binutils-gdb.

Full details are available at:
    https://builder.sourceware.org/buildbot/#/builders/133/builds/3092

Build state: failed compile (failure)
Revision: 58ce812559c95eb80cac0ea2ec6ca9da768e48f2
Worker: bbo1-2
Build Reason: (unknown)
Blamelist: GDB Administrator <gdbadmin@sourceware.org>, Lancelot SIX <lancelot.six@amd.com>

Steps:

- 0: worker_preparation ( success )

- 1: git checkout ( success )
    Logs:
        - stdio: https://builder.sourceware.org/buildbot/#/builders/133/builds/3092/steps/1/logs/stdio

- 2: rm -rf binutils-build ( success )
    Logs:
        - stdio: https://builder.sourceware.org/buildbot/#/builders/133/builds/3092/steps/2/logs/stdio

- 3: configure ( success )
    Logs:
        - stdio: https://builder.sourceware.org/buildbot/#/builders/133/builds/3092/steps/3/logs/stdio
        - config.log: https://builder.sourceware.org/buildbot/#/builders/133/builds/3092/steps/3/logs/config_log

- 4: make ( failure )
    Logs:
        - stdio: https://builder.sourceware.org/buildbot/#/builders/133/builds/3092/steps/4/logs/stdio
        - warnings (19): https://builder.sourceware.org/buildbot/#/builders/133/builds/3092/steps/4/logs/warnings__19_


^ permalink raw reply	[flat|nested] 29+ messages in thread

* ☠ Buildbot (Sourceware): binutils-gdb - failed compile (failure) (master)
@ 2024-01-16 11:31 builder
  0 siblings, 0 replies; 29+ messages in thread
From: builder @ 2024-01-16 11:31 UTC (permalink / raw)
  To: binutils

A new failure has been detected on builder binutils-fedora-x86_64 while building binutils-gdb.

Full details are available at:
    https://builder.sourceware.org/buildbot/#/builders/77/builds/3327

Build state: failed compile (failure)
Revision: 5c77e72e015ec1fcdcbf78b4f2a4f245922e666f
Worker: bb1-2
Build Reason: (unknown)
Blamelist: Victor Do Nascimento <victor.donascimento@arm.com>

Steps:

- 0: worker_preparation ( success )

- 1: git checkout ( success )
    Logs:
        - stdio: https://builder.sourceware.org/buildbot/#/builders/77/builds/3327/steps/1/logs/stdio

- 2: rm -rf binutils-build ( success )
    Logs:
        - stdio: https://builder.sourceware.org/buildbot/#/builders/77/builds/3327/steps/2/logs/stdio

- 3: configure ( success )
    Logs:
        - stdio: https://builder.sourceware.org/buildbot/#/builders/77/builds/3327/steps/3/logs/stdio
        - config.log: https://builder.sourceware.org/buildbot/#/builders/77/builds/3327/steps/3/logs/config_log

- 4: make ( failure )
    Logs:
        - stdio: https://builder.sourceware.org/buildbot/#/builders/77/builds/3327/steps/4/logs/stdio
        - warnings (13): https://builder.sourceware.org/buildbot/#/builders/77/builds/3327/steps/4/logs/warnings__13_

A new failure has been detected on builder binutils-rawhide-x86_64 while building binutils-gdb.

Full details are available at:
    https://builder.sourceware.org/buildbot/#/builders/133/builds/3064

Build state: failed compile (failure)
Revision: 5c77e72e015ec1fcdcbf78b4f2a4f245922e666f
Worker: bbo1-2
Build Reason: (unknown)
Blamelist: Victor Do Nascimento <victor.donascimento@arm.com>

Steps:

- 0: worker_preparation ( success )

- 1: git checkout ( success )
    Logs:
        - stdio: https://builder.sourceware.org/buildbot/#/builders/133/builds/3064/steps/1/logs/stdio

- 2: rm -rf binutils-build ( success )
    Logs:
        - stdio: https://builder.sourceware.org/buildbot/#/builders/133/builds/3064/steps/2/logs/stdio

- 3: configure ( success )
    Logs:
        - stdio: https://builder.sourceware.org/buildbot/#/builders/133/builds/3064/steps/3/logs/stdio
        - config.log: https://builder.sourceware.org/buildbot/#/builders/133/builds/3064/steps/3/logs/config_log

- 4: make ( failure )
    Logs:
        - stdio: https://builder.sourceware.org/buildbot/#/builders/133/builds/3064/steps/4/logs/stdio
        - warnings (14): https://builder.sourceware.org/buildbot/#/builders/133/builds/3064/steps/4/logs/warnings__14_


^ permalink raw reply	[flat|nested] 29+ messages in thread

* ☠ Buildbot (Sourceware): binutils-gdb - failed compile (failure) (master)
@ 2024-01-16 10:22 builder
  0 siblings, 0 replies; 29+ messages in thread
From: builder @ 2024-01-16 10:22 UTC (permalink / raw)
  To: binutils

A new failure has been detected on builder binutils-fedora-x86_64 while building binutils-gdb.

Full details are available at:
    https://builder.sourceware.org/buildbot/#/builders/77/builds/3325

Build state: failed compile (failure)
Revision: c35460087723932ba7300072099bd0d65d9ce6d2
Worker: bb3
Build Reason: (unknown)
Blamelist: Victor Do Nascimento <victor.donascimento@arm.com>

Steps:

- 0: worker_preparation ( success )

- 1: git checkout ( success )
    Logs:
        - stdio: https://builder.sourceware.org/buildbot/#/builders/77/builds/3325/steps/1/logs/stdio

- 2: rm -rf binutils-build ( success )
    Logs:
        - stdio: https://builder.sourceware.org/buildbot/#/builders/77/builds/3325/steps/2/logs/stdio

- 3: configure ( success )
    Logs:
        - stdio: https://builder.sourceware.org/buildbot/#/builders/77/builds/3325/steps/3/logs/stdio
        - config.log: https://builder.sourceware.org/buildbot/#/builders/77/builds/3325/steps/3/logs/config_log

- 4: make ( failure )
    Logs:
        - stdio: https://builder.sourceware.org/buildbot/#/builders/77/builds/3325/steps/4/logs/stdio
        - warnings (13): https://builder.sourceware.org/buildbot/#/builders/77/builds/3325/steps/4/logs/warnings__13_

A new failure has been detected on builder binutils-rawhide-x86_64 while building binutils-gdb.

Full details are available at:
    https://builder.sourceware.org/buildbot/#/builders/133/builds/3062

Build state: failed compile (failure)
Revision: c35460087723932ba7300072099bd0d65d9ce6d2
Worker: bb2-1
Build Reason: (unknown)
Blamelist: Victor Do Nascimento <victor.donascimento@arm.com>

Steps:

- 0: worker_preparation ( success )

- 1: git checkout ( success )
    Logs:
        - stdio: https://builder.sourceware.org/buildbot/#/builders/133/builds/3062/steps/1/logs/stdio

- 2: rm -rf binutils-build ( success )
    Logs:
        - stdio: https://builder.sourceware.org/buildbot/#/builders/133/builds/3062/steps/2/logs/stdio

- 3: configure ( success )
    Logs:
        - stdio: https://builder.sourceware.org/buildbot/#/builders/133/builds/3062/steps/3/logs/stdio
        - config.log: https://builder.sourceware.org/buildbot/#/builders/133/builds/3062/steps/3/logs/config_log

- 4: make ( failure )
    Logs:
        - stdio: https://builder.sourceware.org/buildbot/#/builders/133/builds/3062/steps/4/logs/stdio
        - warnings (14): https://builder.sourceware.org/buildbot/#/builders/133/builds/3062/steps/4/logs/warnings__14_


^ permalink raw reply	[flat|nested] 29+ messages in thread

* ☠ Buildbot (Sourceware): binutils-gdb - failed compile (failure) (master)
@ 2023-12-29  7:43 builder
  0 siblings, 0 replies; 29+ messages in thread
From: builder @ 2023-12-29  7:43 UTC (permalink / raw)
  To: binutils

A new failure has been detected on builder binutils-fedora-x86_64 while building binutils-gdb.

Full details are available at:
    https://builder.sourceware.org/buildbot/#/builders/77/builds/3181

Build state: failed compile (failure)
Revision: aae8784c58d693fa8bc0161b325fc8bcd76d18fc
Worker: bbo1-2
Build Reason: (unknown)
Blamelist: changjiachen <changjiachen@stu.xupt.edu.cn>

Steps:

- 0: worker_preparation ( success )

- 1: git checkout ( success )
    Logs:
        - stdio: https://builder.sourceware.org/buildbot/#/builders/77/builds/3181/steps/1/logs/stdio

- 2: rm -rf binutils-build ( success )
    Logs:
        - stdio: https://builder.sourceware.org/buildbot/#/builders/77/builds/3181/steps/2/logs/stdio

- 3: configure ( success )
    Logs:
        - stdio: https://builder.sourceware.org/buildbot/#/builders/77/builds/3181/steps/3/logs/stdio
        - config.log: https://builder.sourceware.org/buildbot/#/builders/77/builds/3181/steps/3/logs/config_log

- 4: make ( failure )
    Logs:
        - stdio: https://builder.sourceware.org/buildbot/#/builders/77/builds/3181/steps/4/logs/stdio
        - warnings (12): https://builder.sourceware.org/buildbot/#/builders/77/builds/3181/steps/4/logs/warnings__12_

A new failure has been detected on builder binutils-debian-ppc64 while building binutils-gdb.

Full details are available at:
    https://builder.sourceware.org/buildbot/#/builders/78/builds/3158

Build state: failed compile (failure)
Revision: aae8784c58d693fa8bc0161b325fc8bcd76d18fc
Worker: debian-ppc64
Build Reason: (unknown)
Blamelist: changjiachen <changjiachen@stu.xupt.edu.cn>

Steps:

- 0: worker_preparation ( success )

- 1: git checkout ( success )
    Logs:
        - stdio: https://builder.sourceware.org/buildbot/#/builders/78/builds/3158/steps/1/logs/stdio

- 2: rm -rf binutils-build ( success )
    Logs:
        - stdio: https://builder.sourceware.org/buildbot/#/builders/78/builds/3158/steps/2/logs/stdio

- 3: configure ( success )
    Logs:
        - stdio: https://builder.sourceware.org/buildbot/#/builders/78/builds/3158/steps/3/logs/stdio
        - config.log: https://builder.sourceware.org/buildbot/#/builders/78/builds/3158/steps/3/logs/config_log

- 4: make ( failure )
    Logs:
        - stdio: https://builder.sourceware.org/buildbot/#/builders/78/builds/3158/steps/4/logs/stdio
        - warnings (8): https://builder.sourceware.org/buildbot/#/builders/78/builds/3158/steps/4/logs/warnings__8_

A new failure has been detected on builder binutils-fedora-ppc64le while building binutils-gdb.

Full details are available at:
    https://builder.sourceware.org/buildbot/#/builders/86/builds/3059

Build state: failed compile (failure)
Revision: aae8784c58d693fa8bc0161b325fc8bcd76d18fc
Worker: fedora-ppc64le
Build Reason: (unknown)
Blamelist: changjiachen <changjiachen@stu.xupt.edu.cn>

Steps:

- 0: worker_preparation ( success )

- 1: git checkout ( success )
    Logs:
        - stdio: https://builder.sourceware.org/buildbot/#/builders/86/builds/3059/steps/1/logs/stdio

- 2: rm -rf binutils-build ( success )
    Logs:
        - stdio: https://builder.sourceware.org/buildbot/#/builders/86/builds/3059/steps/2/logs/stdio

- 3: configure ( success )
    Logs:
        - stdio: https://builder.sourceware.org/buildbot/#/builders/86/builds/3059/steps/3/logs/stdio
        - config.log: https://builder.sourceware.org/buildbot/#/builders/86/builds/3059/steps/3/logs/config_log

- 4: make ( failure )
    Logs:
        - stdio: https://builder.sourceware.org/buildbot/#/builders/86/builds/3059/steps/4/logs/stdio
        - warnings (12): https://builder.sourceware.org/buildbot/#/builders/86/builds/3059/steps/4/logs/warnings__12_

A new failure has been detected on builder binutils-opensuseleap-x86_64 while building binutils-gdb.

Full details are available at:
    https://builder.sourceware.org/buildbot/#/builders/93/builds/3065

Build state: failed compile (failure)
Revision: aae8784c58d693fa8bc0161b325fc8bcd76d18fc
Worker: bbo1-2
Build Reason: (unknown)
Blamelist: Jin Ma <jinma@linux.alibaba.com>, changjiachen <changjiachen@stu.xupt.edu.cn>

Steps:

- 0: worker_preparation ( success )

- 1: git checkout ( success )
    Logs:
        - stdio: https://builder.sourceware.org/buildbot/#/builders/93/builds/3065/steps/1/logs/stdio

- 2: rm -rf binutils-build ( success )
    Logs:
        - stdio: https://builder.sourceware.org/buildbot/#/builders/93/builds/3065/steps/2/logs/stdio

- 3: configure ( success )
    Logs:
        - stdio: https://builder.sourceware.org/buildbot/#/builders/93/builds/3065/steps/3/logs/stdio
        - config.log: https://builder.sourceware.org/buildbot/#/builders/93/builds/3065/steps/3/logs/config_log

- 4: make ( failure )
    Logs:
        - stdio: https://builder.sourceware.org/buildbot/#/builders/93/builds/3065/steps/4/logs/stdio
        - warnings (7): https://builder.sourceware.org/buildbot/#/builders/93/builds/3065/steps/4/logs/warnings__7_

A new failure has been detected on builder binutils-opensusetw-x86_64 while building binutils-gdb.

Full details are available at:
    https://builder.sourceware.org/buildbot/#/builders/102/builds/3068

Build state: failed compile (failure)
Revision: aae8784c58d693fa8bc0161b325fc8bcd76d18fc
Worker: bbo1-2
Build Reason: (unknown)
Blamelist: changjiachen <changjiachen@stu.xupt.edu.cn>

Steps:

- 0: worker_preparation ( success )

- 1: git checkout ( success )
    Logs:
        - stdio: https://builder.sourceware.org/buildbot/#/builders/102/builds/3068/steps/1/logs/stdio

- 2: rm -rf binutils-build ( success )
    Logs:
        - stdio: https://builder.sourceware.org/buildbot/#/builders/102/builds/3068/steps/2/logs/stdio

- 3: configure ( success )
    Logs:
        - stdio: https://builder.sourceware.org/buildbot/#/builders/102/builds/3068/steps/3/logs/stdio
        - config.log: https://builder.sourceware.org/buildbot/#/builders/102/builds/3068/steps/3/logs/config_log

- 4: make ( failure )
    Logs:
        - stdio: https://builder.sourceware.org/buildbot/#/builders/102/builds/3068/steps/4/logs/stdio
        - warnings (8): https://builder.sourceware.org/buildbot/#/builders/102/builds/3068/steps/4/logs/warnings__8_

A new failure has been detected on builder binutils-rawhide-x86_64 while building binutils-gdb.

Full details are available at:
    https://builder.sourceware.org/buildbot/#/builders/133/builds/2919

Build state: failed compile (failure)
Revision: aae8784c58d693fa8bc0161b325fc8bcd76d18fc
Worker: bb1-2
Build Reason: (unknown)
Blamelist: changjiachen <changjiachen@stu.xupt.edu.cn>

Steps:

- 0: worker_preparation ( success )

- 1: git checkout ( success )
    Logs:
        - stdio: https://builder.sourceware.org/buildbot/#/builders/133/builds/2919/steps/1/logs/stdio

- 2: rm -rf binutils-build ( success )
    Logs:
        - stdio: https://builder.sourceware.org/buildbot/#/builders/133/builds/2919/steps/2/logs/stdio

- 3: configure ( success )
    Logs:
        - stdio: https://builder.sourceware.org/buildbot/#/builders/133/builds/2919/steps/3/logs/stdio
        - config.log: https://builder.sourceware.org/buildbot/#/builders/133/builds/2919/steps/3/logs/config_log

- 4: make ( failure )
    Logs:
        - stdio: https://builder.sourceware.org/buildbot/#/builders/133/builds/2919/steps/4/logs/stdio
        - warnings (12): https://builder.sourceware.org/buildbot/#/builders/133/builds/2919/steps/4/logs/warnings__12_


^ permalink raw reply	[flat|nested] 29+ messages in thread

* ☠ Buildbot (Sourceware): binutils-gdb - failed compile (failure) (master)
@ 2023-11-24  9:13 builder
  0 siblings, 0 replies; 29+ messages in thread
From: builder @ 2023-11-24  9:13 UTC (permalink / raw)
  To: binutils

A new failure has been detected on builder binutils-debian-amd64 while building binutils-gdb.

Full details are available at:
    https://builder.sourceware.org/buildbot/#builders/68/builds/3039

Build state: failed compile (failure)
Revision: 27b33966b18ed8bf1701a60999448224b1d28273
Worker: bb1-1
Build Reason: (unknown)
Blamelist: Jan Beulich <jbeulich@suse.com>

Steps:

- 0: worker_preparation ( success )

- 1: git checkout ( success )
    Logs:
        - stdio: https://builder.sourceware.org/buildbot/#builders/68/builds/3039/steps/1/logs/stdio

- 2: rm -rf binutils-build ( success )
    Logs:
        - stdio: https://builder.sourceware.org/buildbot/#builders/68/builds/3039/steps/2/logs/stdio

- 3: configure ( success )
    Logs:
        - stdio: https://builder.sourceware.org/buildbot/#builders/68/builds/3039/steps/3/logs/stdio
        - config.log: https://builder.sourceware.org/buildbot/#builders/68/builds/3039/steps/3/logs/config_log

- 4: make ( failure )
    Logs:
        - stdio: https://builder.sourceware.org/buildbot/#builders/68/builds/3039/steps/4/logs/stdio
        - warnings (10): https://builder.sourceware.org/buildbot/#builders/68/builds/3039/steps/4/logs/warnings__10_

A new failure has been detected on builder binutils-fedora-x86_64 while building binutils-gdb.

Full details are available at:
    https://builder.sourceware.org/buildbot/#builders/77/builds/3015

Build state: failed compile (failure)
Revision: 27b33966b18ed8bf1701a60999448224b1d28273
Worker: bb1-2
Build Reason: (unknown)
Blamelist: Jan Beulich <jbeulich@suse.com>

Steps:

- 0: worker_preparation ( success )

- 1: git checkout ( success )
    Logs:
        - stdio: https://builder.sourceware.org/buildbot/#builders/77/builds/3015/steps/1/logs/stdio

- 2: rm -rf binutils-build ( success )
    Logs:
        - stdio: https://builder.sourceware.org/buildbot/#builders/77/builds/3015/steps/2/logs/stdio

- 3: configure ( success )
    Logs:
        - stdio: https://builder.sourceware.org/buildbot/#builders/77/builds/3015/steps/3/logs/stdio
        - config.log: https://builder.sourceware.org/buildbot/#builders/77/builds/3015/steps/3/logs/config_log

- 4: make ( failure )
    Logs:
        - stdio: https://builder.sourceware.org/buildbot/#builders/77/builds/3015/steps/4/logs/stdio
        - warnings (13): https://builder.sourceware.org/buildbot/#builders/77/builds/3015/steps/4/logs/warnings__13_

A new failure has been detected on builder binutils-debian-ppc64 while building binutils-gdb.

Full details are available at:
    https://builder.sourceware.org/buildbot/#builders/78/builds/2992

Build state: failed compile (failure)
Revision: 27b33966b18ed8bf1701a60999448224b1d28273
Worker: debian-ppc64
Build Reason: (unknown)
Blamelist: Jan Beulich <jbeulich@suse.com>

Steps:

- 0: worker_preparation ( success )

- 1: git checkout ( success )
    Logs:
        - stdio: https://builder.sourceware.org/buildbot/#builders/78/builds/2992/steps/1/logs/stdio

- 2: rm -rf binutils-build ( success )
    Logs:
        - stdio: https://builder.sourceware.org/buildbot/#builders/78/builds/2992/steps/2/logs/stdio

- 3: configure ( success )
    Logs:
        - stdio: https://builder.sourceware.org/buildbot/#builders/78/builds/2992/steps/3/logs/stdio
        - config.log: https://builder.sourceware.org/buildbot/#builders/78/builds/2992/steps/3/logs/config_log

- 4: make ( failure )
    Logs:
        - stdio: https://builder.sourceware.org/buildbot/#builders/78/builds/2992/steps/4/logs/stdio
        - warnings (8): https://builder.sourceware.org/buildbot/#builders/78/builds/2992/steps/4/logs/warnings__8_

A new failure has been detected on builder binutils-fedora-ppc64le while building binutils-gdb.

Full details are available at:
    https://builder.sourceware.org/buildbot/#builders/86/builds/2893

Build state: failed compile (failure)
Revision: 27b33966b18ed8bf1701a60999448224b1d28273
Worker: fedora-ppc64le
Build Reason: (unknown)
Blamelist: Jan Beulich <jbeulich@suse.com>

Steps:

- 0: worker_preparation ( success )

- 1: git checkout ( success )
    Logs:
        - stdio: https://builder.sourceware.org/buildbot/#builders/86/builds/2893/steps/1/logs/stdio

- 2: rm -rf binutils-build ( success )
    Logs:
        - stdio: https://builder.sourceware.org/buildbot/#builders/86/builds/2893/steps/2/logs/stdio

- 3: configure ( success )
    Logs:
        - stdio: https://builder.sourceware.org/buildbot/#builders/86/builds/2893/steps/3/logs/stdio
        - config.log: https://builder.sourceware.org/buildbot/#builders/86/builds/2893/steps/3/logs/config_log

- 4: make ( failure )
    Logs:
        - stdio: https://builder.sourceware.org/buildbot/#builders/86/builds/2893/steps/4/logs/stdio
        - warnings (13): https://builder.sourceware.org/buildbot/#builders/86/builds/2893/steps/4/logs/warnings__13_

A new failure has been detected on builder binutils-opensuseleap-x86_64 while building binutils-gdb.

Full details are available at:
    https://builder.sourceware.org/buildbot/#builders/93/builds/2899

Build state: failed compile (failure)
Revision: 27b33966b18ed8bf1701a60999448224b1d28273
Worker: bb2-2
Build Reason: (unknown)
Blamelist: Jan Beulich <jbeulich@suse.com>

Steps:

- 0: worker_preparation ( success )

- 1: git checkout ( success )
    Logs:
        - stdio: https://builder.sourceware.org/buildbot/#builders/93/builds/2899/steps/1/logs/stdio

- 2: rm -rf binutils-build ( success )
    Logs:
        - stdio: https://builder.sourceware.org/buildbot/#builders/93/builds/2899/steps/2/logs/stdio

- 3: configure ( success )
    Logs:
        - stdio: https://builder.sourceware.org/buildbot/#builders/93/builds/2899/steps/3/logs/stdio
        - config.log: https://builder.sourceware.org/buildbot/#builders/93/builds/2899/steps/3/logs/config_log

- 4: make ( failure )
    Logs:
        - stdio: https://builder.sourceware.org/buildbot/#builders/93/builds/2899/steps/4/logs/stdio
        - warnings (7): https://builder.sourceware.org/buildbot/#builders/93/builds/2899/steps/4/logs/warnings__7_

A new failure has been detected on builder binutils-opensusetw-x86_64 while building binutils-gdb.

Full details are available at:
    https://builder.sourceware.org/buildbot/#builders/102/builds/2902

Build state: failed compile (failure)
Revision: 27b33966b18ed8bf1701a60999448224b1d28273
Worker: bb1-1
Build Reason: (unknown)
Blamelist: Jan Beulich <jbeulich@suse.com>

Steps:

- 0: worker_preparation ( success )

- 1: git checkout ( success )
    Logs:
        - stdio: https://builder.sourceware.org/buildbot/#builders/102/builds/2902/steps/1/logs/stdio

- 2: rm -rf binutils-build ( success )
    Logs:
        - stdio: https://builder.sourceware.org/buildbot/#builders/102/builds/2902/steps/2/logs/stdio

- 3: configure ( success )
    Logs:
        - stdio: https://builder.sourceware.org/buildbot/#builders/102/builds/2902/steps/3/logs/stdio
        - config.log: https://builder.sourceware.org/buildbot/#builders/102/builds/2902/steps/3/logs/config_log

- 4: make ( failure )
    Logs:
        - stdio: https://builder.sourceware.org/buildbot/#builders/102/builds/2902/steps/4/logs/stdio
        - warnings (8): https://builder.sourceware.org/buildbot/#builders/102/builds/2902/steps/4/logs/warnings__8_

A new failure has been detected on builder binutils-rawhide-x86_64 while building binutils-gdb.

Full details are available at:
    https://builder.sourceware.org/buildbot/#builders/133/builds/2753

Build state: failed compile (failure)
Revision: 27b33966b18ed8bf1701a60999448224b1d28273
Worker: bb1-2
Build Reason: (unknown)
Blamelist: Jan Beulich <jbeulich@suse.com>

Steps:

- 0: worker_preparation ( success )

- 1: git checkout ( success )
    Logs:
        - stdio: https://builder.sourceware.org/buildbot/#builders/133/builds/2753/steps/1/logs/stdio

- 2: rm -rf binutils-build ( success )
    Logs:
        - stdio: https://builder.sourceware.org/buildbot/#builders/133/builds/2753/steps/2/logs/stdio

- 3: configure ( success )
    Logs:
        - stdio: https://builder.sourceware.org/buildbot/#builders/133/builds/2753/steps/3/logs/stdio
        - config.log: https://builder.sourceware.org/buildbot/#builders/133/builds/2753/steps/3/logs/config_log

- 4: make ( failure )
    Logs:
        - stdio: https://builder.sourceware.org/buildbot/#builders/133/builds/2753/steps/4/logs/stdio
        - warnings (14): https://builder.sourceware.org/buildbot/#builders/133/builds/2753/steps/4/logs/warnings__14_

A new failure has been detected on builder binutils-debian-testing-x86_64 while building binutils-gdb.

Full details are available at:
    https://builder.sourceware.org/buildbot/#builders/149/builds/2747

Build state: failed compile (failure)
Revision: 27b33966b18ed8bf1701a60999448224b1d28273
Worker: bb2-2
Build Reason: (unknown)
Blamelist: Jan Beulich <jbeulich@suse.com>

Steps:

- 0: worker_preparation ( success )

- 1: git checkout ( success )
    Logs:
        - stdio: https://builder.sourceware.org/buildbot/#builders/149/builds/2747/steps/1/logs/stdio

- 2: rm -rf binutils-build ( success )
    Logs:
        - stdio: https://builder.sourceware.org/buildbot/#builders/149/builds/2747/steps/2/logs/stdio

- 3: configure ( success )
    Logs:
        - stdio: https://builder.sourceware.org/buildbot/#builders/149/builds/2747/steps/3/logs/stdio
        - config.log: https://builder.sourceware.org/buildbot/#builders/149/builds/2747/steps/3/logs/config_log

- 4: make ( failure )
    Logs:
        - stdio: https://builder.sourceware.org/buildbot/#builders/149/builds/2747/steps/4/logs/stdio
        - warnings (7): https://builder.sourceware.org/buildbot/#builders/149/builds/2747/steps/4/logs/warnings__7_


^ permalink raw reply	[flat|nested] 29+ messages in thread

* Re: ☠ Buildbot (Sourceware): binutils-gdb - failed compile (failure) (master)
  2023-10-13 14:40 builder
@ 2023-10-13 14:48 ` Clément Chigot
  0 siblings, 0 replies; 29+ messages in thread
From: Clément Chigot @ 2023-10-13 14:48 UTC (permalink / raw)
  To: builder; +Cc: binutils

This is mine. Not sure why I don't have the error message locally
though. Maybe something with -Werror. I'll push the following fix:

Author: Clément Chigot <chigot@adacore.com>
Date:   Fri Oct 13 16:43:32 2023 +0200

    ld: replace wrong bfd_malloc in nto.em

    xmalloc should be used in emultation template instead of bfd_malloc.

    ld/ChangeLog:

            * emultempl/nto.em (nto_lookup_QNX_note_section): Replace
            bfd_malloc by xmalloc.

diff --git a/ld/emultempl/nto.em b/ld/emultempl/nto.em
index f4c76f18fc2..273502dd802 100644
--- a/ld/emultempl/nto.em
+++ b/ld/emultempl/nto.em
@@ -98,7 +98,7 @@ nto_lookup_QNX_note_section(int type)
        continue;

       /* Verify that this is a QNX note of the expected type.  */
-      sec->contents = bfd_malloc(sec->size);
+      sec->contents = xmalloc(sec->size);
       if (!bfd_get_section_contents (sec->owner, sec, sec->contents,
(file_ptr) 0,
                                     sec->size))
        einfo (_("%F%P: %pB: can't read contents of section .note: %E\n"),

Sorry about the trouble
Clément

^ permalink raw reply	[flat|nested] 29+ messages in thread

* ☠ Buildbot (Sourceware): binutils-gdb - failed compile (failure) (master)
@ 2023-10-13 14:40 builder
  2023-10-13 14:48 ` Clément Chigot
  0 siblings, 1 reply; 29+ messages in thread
From: builder @ 2023-10-13 14:40 UTC (permalink / raw)
  To: binutils

A new failure has been detected on builder binutils-debian-amd64 while building binutils-gdb.

Full details are available at:
    https://builder.sourceware.org/buildbot/#builders/68/builds/2825

Build state: failed compile (failure)
Revision: 318d83e658773d09a0cd62f65aa3bb4bf4474a38
Worker: bb2-1
Build Reason: (unknown)
Blamelist: Clément Chigot <chigot@adacore.com>

Steps:

- 0: worker_preparation ( success )

- 1: git checkout ( success )
    Logs:
        - stdio: https://builder.sourceware.org/buildbot/#builders/68/builds/2825/steps/1/logs/stdio

- 2: rm -rf binutils-build ( success )
    Logs:
        - stdio: https://builder.sourceware.org/buildbot/#builders/68/builds/2825/steps/2/logs/stdio

- 3: configure ( success )
    Logs:
        - stdio: https://builder.sourceware.org/buildbot/#builders/68/builds/2825/steps/3/logs/stdio
        - config.log: https://builder.sourceware.org/buildbot/#builders/68/builds/2825/steps/3/logs/config_log

- 4: make ( failure )
    Logs:
        - stdio: https://builder.sourceware.org/buildbot/#builders/68/builds/2825/steps/4/logs/stdio
        - warnings (20): https://builder.sourceware.org/buildbot/#builders/68/builds/2825/steps/4/logs/warnings__20_

A new failure has been detected on builder binutils-fedora-x86_64 while building binutils-gdb.

Full details are available at:
    https://builder.sourceware.org/buildbot/#builders/77/builds/2802

Build state: failed compile (failure)
Revision: 318d83e658773d09a0cd62f65aa3bb4bf4474a38
Worker: bb2-2
Build Reason: (unknown)
Blamelist: Clément Chigot <chigot@adacore.com>

Steps:

- 0: worker_preparation ( success )

- 1: git checkout ( success )
    Logs:
        - stdio: https://builder.sourceware.org/buildbot/#builders/77/builds/2802/steps/1/logs/stdio

- 2: rm -rf binutils-build ( success )
    Logs:
        - stdio: https://builder.sourceware.org/buildbot/#builders/77/builds/2802/steps/2/logs/stdio

- 3: configure ( success )
    Logs:
        - stdio: https://builder.sourceware.org/buildbot/#builders/77/builds/2802/steps/3/logs/stdio
        - config.log: https://builder.sourceware.org/buildbot/#builders/77/builds/2802/steps/3/logs/config_log

- 4: make ( failure )
    Logs:
        - stdio: https://builder.sourceware.org/buildbot/#builders/77/builds/2802/steps/4/logs/stdio
        - warnings (62): https://builder.sourceware.org/buildbot/#builders/77/builds/2802/steps/4/logs/warnings__62_

A new failure has been detected on builder binutils-debian-ppc64 while building binutils-gdb.

Full details are available at:
    https://builder.sourceware.org/buildbot/#builders/78/builds/2779

Build state: failed compile (failure)
Revision: 318d83e658773d09a0cd62f65aa3bb4bf4474a38
Worker: debian-ppc64
Build Reason: (unknown)
Blamelist: Clément Chigot <chigot@adacore.com>

Steps:

- 0: worker_preparation ( success )

- 1: git checkout ( success )
    Logs:
        - stdio: https://builder.sourceware.org/buildbot/#builders/78/builds/2779/steps/1/logs/stdio

- 2: rm -rf binutils-build ( success )
    Logs:
        - stdio: https://builder.sourceware.org/buildbot/#builders/78/builds/2779/steps/2/logs/stdio

- 3: configure ( success )
    Logs:
        - stdio: https://builder.sourceware.org/buildbot/#builders/78/builds/2779/steps/3/logs/stdio
        - config.log: https://builder.sourceware.org/buildbot/#builders/78/builds/2779/steps/3/logs/config_log

- 4: make ( failure )
    Logs:
        - stdio: https://builder.sourceware.org/buildbot/#builders/78/builds/2779/steps/4/logs/stdio
        - warnings (22): https://builder.sourceware.org/buildbot/#builders/78/builds/2779/steps/4/logs/warnings__22_

A new failure has been detected on builder binutils-fedora-ppc64le while building binutils-gdb.

Full details are available at:
    https://builder.sourceware.org/buildbot/#builders/86/builds/2680

Build state: failed compile (failure)
Revision: 318d83e658773d09a0cd62f65aa3bb4bf4474a38
Worker: fedora-ppc64le
Build Reason: (unknown)
Blamelist: Clément Chigot <chigot@adacore.com>

Steps:

- 0: worker_preparation ( success )

- 1: git checkout ( success )
    Logs:
        - stdio: https://builder.sourceware.org/buildbot/#builders/86/builds/2680/steps/1/logs/stdio

- 2: rm -rf binutils-build ( success )
    Logs:
        - stdio: https://builder.sourceware.org/buildbot/#builders/86/builds/2680/steps/2/logs/stdio

- 3: configure ( success )
    Logs:
        - stdio: https://builder.sourceware.org/buildbot/#builders/86/builds/2680/steps/3/logs/stdio
        - config.log: https://builder.sourceware.org/buildbot/#builders/86/builds/2680/steps/3/logs/config_log

- 4: make ( failure )
    Logs:
        - stdio: https://builder.sourceware.org/buildbot/#builders/86/builds/2680/steps/4/logs/stdio
        - warnings (62): https://builder.sourceware.org/buildbot/#builders/86/builds/2680/steps/4/logs/warnings__62_

A new failure has been detected on builder binutils-opensuseleap-x86_64 while building binutils-gdb.

Full details are available at:
    https://builder.sourceware.org/buildbot/#builders/93/builds/2686

Build state: failed compile (failure)
Revision: 318d83e658773d09a0cd62f65aa3bb4bf4474a38
Worker: bb1-2
Build Reason: (unknown)
Blamelist: Clément Chigot <chigot@adacore.com>

Steps:

- 0: worker_preparation ( success )

- 1: git checkout ( success )
    Logs:
        - stdio: https://builder.sourceware.org/buildbot/#builders/93/builds/2686/steps/1/logs/stdio

- 2: rm -rf binutils-build ( success )
    Logs:
        - stdio: https://builder.sourceware.org/buildbot/#builders/93/builds/2686/steps/2/logs/stdio

- 3: configure ( success )
    Logs:
        - stdio: https://builder.sourceware.org/buildbot/#builders/93/builds/2686/steps/3/logs/stdio
        - config.log: https://builder.sourceware.org/buildbot/#builders/93/builds/2686/steps/3/logs/config_log

- 4: make ( failure )
    Logs:
        - stdio: https://builder.sourceware.org/buildbot/#builders/93/builds/2686/steps/4/logs/stdio
        - warnings (60): https://builder.sourceware.org/buildbot/#builders/93/builds/2686/steps/4/logs/warnings__60_

A new failure has been detected on builder binutils-opensusetw-x86_64 while building binutils-gdb.

Full details are available at:
    https://builder.sourceware.org/buildbot/#builders/102/builds/2687

Build state: failed compile (failure)
Revision: 318d83e658773d09a0cd62f65aa3bb4bf4474a38
Worker: bb1-2
Build Reason: (unknown)
Blamelist: Clément Chigot <chigot@adacore.com>

Steps:

- 0: worker_preparation ( success )

- 1: git checkout ( success )
    Logs:
        - stdio: https://builder.sourceware.org/buildbot/#builders/102/builds/2687/steps/1/logs/stdio

- 2: rm -rf binutils-build ( success )
    Logs:
        - stdio: https://builder.sourceware.org/buildbot/#builders/102/builds/2687/steps/2/logs/stdio

- 3: configure ( success )
    Logs:
        - stdio: https://builder.sourceware.org/buildbot/#builders/102/builds/2687/steps/3/logs/stdio
        - config.log: https://builder.sourceware.org/buildbot/#builders/102/builds/2687/steps/3/logs/config_log

- 4: make ( failure )
    Logs:
        - stdio: https://builder.sourceware.org/buildbot/#builders/102/builds/2687/steps/4/logs/stdio
        - warnings (62): https://builder.sourceware.org/buildbot/#builders/102/builds/2687/steps/4/logs/warnings__62_

A new failure has been detected on builder binutils-rawhide-x86_64 while building binutils-gdb.

Full details are available at:
    https://builder.sourceware.org/buildbot/#builders/133/builds/2538

Build state: failed compile (failure)
Revision: 318d83e658773d09a0cd62f65aa3bb4bf4474a38
Worker: bb1-1
Build Reason: (unknown)
Blamelist: Clément Chigot <chigot@adacore.com>

Steps:

- 0: worker_preparation ( success )

- 1: git checkout ( success )
    Logs:
        - stdio: https://builder.sourceware.org/buildbot/#builders/133/builds/2538/steps/1/logs/stdio

- 2: rm -rf binutils-build ( success )
    Logs:
        - stdio: https://builder.sourceware.org/buildbot/#builders/133/builds/2538/steps/2/logs/stdio

- 3: configure ( success )
    Logs:
        - stdio: https://builder.sourceware.org/buildbot/#builders/133/builds/2538/steps/3/logs/stdio
        - config.log: https://builder.sourceware.org/buildbot/#builders/133/builds/2538/steps/3/logs/config_log

- 4: make ( failure )
    Logs:
        - stdio: https://builder.sourceware.org/buildbot/#builders/133/builds/2538/steps/4/logs/stdio
        - warnings (62): https://builder.sourceware.org/buildbot/#builders/133/builds/2538/steps/4/logs/warnings__62_

A new failure has been detected on builder binutils-debian-testing-x86_64 while building binutils-gdb.

Full details are available at:
    https://builder.sourceware.org/buildbot/#builders/149/builds/2529

Build state: failed compile (failure)
Revision: 318d83e658773d09a0cd62f65aa3bb4bf4474a38
Worker: bb1-1
Build Reason: (unknown)
Blamelist: Clément Chigot <chigot@adacore.com>

Steps:

- 0: worker_preparation ( success )

- 1: git checkout ( success )
    Logs:
        - stdio: https://builder.sourceware.org/buildbot/#builders/149/builds/2529/steps/1/logs/stdio

- 2: rm -rf binutils-build ( success )
    Logs:
        - stdio: https://builder.sourceware.org/buildbot/#builders/149/builds/2529/steps/2/logs/stdio

- 3: configure ( success )
    Logs:
        - stdio: https://builder.sourceware.org/buildbot/#builders/149/builds/2529/steps/3/logs/stdio
        - config.log: https://builder.sourceware.org/buildbot/#builders/149/builds/2529/steps/3/logs/config_log

- 4: make ( failure )
    Logs:
        - stdio: https://builder.sourceware.org/buildbot/#builders/149/builds/2529/steps/4/logs/stdio
        - warnings (20): https://builder.sourceware.org/buildbot/#builders/149/builds/2529/steps/4/logs/warnings__20_

A new failure has been detected on builder binutils-gentoo-sparc while building binutils-gdb.

Full details are available at:
    https://builder.sourceware.org/buildbot/#builders/228/builds/1404

Build state: failed compile (failure)
Revision: 318d83e658773d09a0cd62f65aa3bb4bf4474a38
Worker: gentoo-sparc
Build Reason: (unknown)
Blamelist: Clément Chigot <chigot@adacore.com>

Steps:

- 0: worker_preparation ( success )

- 1: git checkout ( success )
    Logs:
        - stdio: https://builder.sourceware.org/buildbot/#builders/228/builds/1404/steps/1/logs/stdio

- 2: rm -rf binutils-build ( success )
    Logs:
        - stdio: https://builder.sourceware.org/buildbot/#builders/228/builds/1404/steps/2/logs/stdio

- 3: configure ( success )
    Logs:
        - stdio: https://builder.sourceware.org/buildbot/#builders/228/builds/1404/steps/3/logs/stdio
        - config.log: https://builder.sourceware.org/buildbot/#builders/228/builds/1404/steps/3/logs/config_log

- 4: make ( failure )
    Logs:
        - stdio: https://builder.sourceware.org/buildbot/#builders/228/builds/1404/steps/4/logs/stdio
        - warnings (22): https://builder.sourceware.org/buildbot/#builders/228/builds/1404/steps/4/logs/warnings__22_


^ permalink raw reply	[flat|nested] 29+ messages in thread

* ☠ Buildbot (Sourceware): binutils-gdb - failed compile (failure) (master)
@ 2023-10-06 20:07 builder
  0 siblings, 0 replies; 29+ messages in thread
From: builder @ 2023-10-06 20:07 UTC (permalink / raw)
  To: binutils

A new failure has been detected on builder binutils-debian-armhf while building binutils-gdb.

Full details are available at:
    https://builder.sourceware.org/buildbot/#builders/80/builds/2101

Build state: failed compile (failure)
Revision: 6bbf249557ba17cfebe01c67370df4da9e6a56f9
Worker: debian-armhf
Build Reason: (unknown)
Blamelist: Andrew Burgess <aburgess@redhat.com>, Neal Frager <neal.frager@amd.com>

Steps:

- 0: worker_preparation ( success )

- 1: git checkout ( success )
    Logs:
        - stdio: https://builder.sourceware.org/buildbot/#builders/80/builds/2101/steps/1/logs/stdio

- 2: rm -rf binutils-build ( success )
    Logs:
        - stdio: https://builder.sourceware.org/buildbot/#builders/80/builds/2101/steps/2/logs/stdio

- 3: configure ( success )
    Logs:
        - stdio: https://builder.sourceware.org/buildbot/#builders/80/builds/2101/steps/3/logs/stdio
        - config.log: https://builder.sourceware.org/buildbot/#builders/80/builds/2101/steps/3/logs/config_log

- 4: make ( failure )
    Logs:
        - stdio: https://builder.sourceware.org/buildbot/#builders/80/builds/2101/steps/4/logs/stdio
        - warnings (16): https://builder.sourceware.org/buildbot/#builders/80/builds/2101/steps/4/logs/warnings__16_

A new failure has been detected on builder binutils-gentoo-sparc while building binutils-gdb.

Full details are available at:
    https://builder.sourceware.org/buildbot/#builders/228/builds/1380

Build state: failed test (failure)
Revision: 6bbf249557ba17cfebe01c67370df4da9e6a56f9
Worker: gentoo-sparc
Build Reason: (unknown)
Blamelist: Andrew Burgess <aburgess@redhat.com>, Neal Frager <neal.frager@amd.com>

Steps:

- 0: worker_preparation ( success )

- 1: git checkout ( success )
    Logs:
        - stdio: https://builder.sourceware.org/buildbot/#builders/228/builds/1380/steps/1/logs/stdio

- 2: rm -rf binutils-build ( success )
    Logs:
        - stdio: https://builder.sourceware.org/buildbot/#builders/228/builds/1380/steps/2/logs/stdio

- 3: configure ( success )
    Logs:
        - stdio: https://builder.sourceware.org/buildbot/#builders/228/builds/1380/steps/3/logs/stdio
        - config.log: https://builder.sourceware.org/buildbot/#builders/228/builds/1380/steps/3/logs/config_log

- 4: make ( warnings )
    Logs:
        - stdio: https://builder.sourceware.org/buildbot/#builders/228/builds/1380/steps/4/logs/stdio
        - warnings (22): https://builder.sourceware.org/buildbot/#builders/228/builds/1380/steps/4/logs/warnings__22_

- 5: make check ( failure )
    Logs:
        - stdio: https://builder.sourceware.org/buildbot/#builders/228/builds/1380/steps/5/logs/stdio
        - ld.sum: https://builder.sourceware.org/buildbot/#builders/228/builds/1380/steps/5/logs/ld_sum
        - ld.log: https://builder.sourceware.org/buildbot/#builders/228/builds/1380/steps/5/logs/ld_log
        - gas.sum: https://builder.sourceware.org/buildbot/#builders/228/builds/1380/steps/5/logs/gas_sum
        - gas.log: https://builder.sourceware.org/buildbot/#builders/228/builds/1380/steps/5/logs/gas_log
        - binutils.sum: https://builder.sourceware.org/buildbot/#builders/228/builds/1380/steps/5/logs/binutils_sum
        - binutils.log: https://builder.sourceware.org/buildbot/#builders/228/builds/1380/steps/5/logs/binutils_log
        - libsframe.sum: https://builder.sourceware.org/buildbot/#builders/228/builds/1380/steps/5/logs/libsframe_sum
        - libsframe.log: https://builder.sourceware.org/buildbot/#builders/228/builds/1380/steps/5/logs/libsframe_log
        - libctf.sum: https://builder.sourceware.org/buildbot/#builders/228/builds/1380/steps/5/logs/libctf_sum
        - libctf.log: https://builder.sourceware.org/buildbot/#builders/228/builds/1380/steps/5/logs/libctf_log
        - warnings (12): https://builder.sourceware.org/buildbot/#builders/228/builds/1380/steps/5/logs/warnings__12_

- 6: prep ( success )
    Logs:
        - stdio: https://builder.sourceware.org/buildbot/#builders/228/builds/1380/steps/6/logs/stdio

- 7: build bunsen.cpio.gz ( success )
    Logs:
        - stdio: https://builder.sourceware.org/buildbot/#builders/228/builds/1380/steps/7/logs/stdio

- 8: fetch bunsen.cpio.gz ( success )
    Logs:
        - stdio: https://builder.sourceware.org/buildbot/#builders/228/builds/1380/steps/8/logs/stdio

- 9: unpack bunsen.cpio.gz ( success )
    Logs:
        - stdio: https://builder.sourceware.org/buildbot/#builders/228/builds/1380/steps/9/logs/stdio

- 10: pass .bunsen.source.gitname ( success )
    Logs:
        - stdio: https://builder.sourceware.org/buildbot/#builders/228/builds/1380/steps/10/logs/stdio

- 11: pass .bunsen.source.gitdescribe ( success )
    Logs:
        - stdio: https://builder.sourceware.org/buildbot/#builders/228/builds/1380/steps/11/logs/stdio

- 12: pass .bunsen.source.gitbranch ( success )
    Logs:
        - stdio: https://builder.sourceware.org/buildbot/#builders/228/builds/1380/steps/12/logs/stdio

- 13: pass .bunsen.source.gitrepo ( success )
    Logs:
        - stdio: https://builder.sourceware.org/buildbot/#builders/228/builds/1380/steps/13/logs/stdio

- 14: upload to bunsen ( success )
    Logs:
        - stdio: https://builder.sourceware.org/buildbot/#builders/228/builds/1380/steps/14/logs/stdio

- 15: clean up ( success )
    Logs:
        - stdio: https://builder.sourceware.org/buildbot/#builders/228/builds/1380/steps/15/logs/stdio

- 16: rm -rf binutils-build_1 ( success )
    Logs:
        - stdio: https://builder.sourceware.org/buildbot/#builders/228/builds/1380/steps/16/logs/stdio


^ permalink raw reply	[flat|nested] 29+ messages in thread

* ☠ Buildbot (Sourceware): binutils-gdb - failed compile (failure) (master)
@ 2023-09-25  9:56 builder
  0 siblings, 0 replies; 29+ messages in thread
From: builder @ 2023-09-25  9:56 UTC (permalink / raw)
  To: binutils

A new failure has been detected on builder binutils-debian-armhf while building binutils-gdb.

Full details are available at:
    https://builder.sourceware.org/buildbot/#builders/80/builds/2046

Build state: failed compile (failure)
Revision: a47d304b1229ecf8912fac17ee9c48d1bf3c729a
Worker: debian-armhf
Build Reason: (unknown)
Blamelist: Claudiu Zissulescu <claziss@gmail.com>, Claudiu Zissulescu <claziss@synopsys.com>

Steps:

- 0: worker_preparation ( success )

- 1: git checkout ( success )
    Logs:
        - stdio: https://builder.sourceware.org/buildbot/#builders/80/builds/2046/steps/1/logs/stdio

- 2: rm -rf binutils-build ( success )
    Logs:
        - stdio: https://builder.sourceware.org/buildbot/#builders/80/builds/2046/steps/2/logs/stdio

- 3: configure ( success )
    Logs:
        - stdio: https://builder.sourceware.org/buildbot/#builders/80/builds/2046/steps/3/logs/stdio
        - config.log: https://builder.sourceware.org/buildbot/#builders/80/builds/2046/steps/3/logs/config_log

- 4: make ( failure )
    Logs:
        - stdio: https://builder.sourceware.org/buildbot/#builders/80/builds/2046/steps/4/logs/stdio
        - warnings (15): https://builder.sourceware.org/buildbot/#builders/80/builds/2046/steps/4/logs/warnings__15_


^ permalink raw reply	[flat|nested] 29+ messages in thread

* ☠ Buildbot (Sourceware): binutils-gdb - failed compile (failure) (master)
@ 2023-09-25  9:22 builder
  0 siblings, 0 replies; 29+ messages in thread
From: builder @ 2023-09-25  9:22 UTC (permalink / raw)
  To: binutils

A new failure has been detected on builder binutils-debian-amd64 while building binutils-gdb.

Full details are available at:
    https://builder.sourceware.org/buildbot/#builders/68/builds/2720

Build state: failed compile (failure)
Revision: 06e8d9861d16c5b7e6920ad0e89889ccf45c575a
Worker: bb1-2
Build Reason: (unknown)
Blamelist: Claudiu Zissulescu <claziss@synopsys.com>

Steps:

- 0: worker_preparation ( success )

- 1: git checkout ( success )
    Logs:
        - stdio: https://builder.sourceware.org/buildbot/#builders/68/builds/2720/steps/1/logs/stdio

- 2: rm -rf binutils-build ( success )
    Logs:
        - stdio: https://builder.sourceware.org/buildbot/#builders/68/builds/2720/steps/2/logs/stdio

- 3: configure ( success )
    Logs:
        - stdio: https://builder.sourceware.org/buildbot/#builders/68/builds/2720/steps/3/logs/stdio
        - config.log: https://builder.sourceware.org/buildbot/#builders/68/builds/2720/steps/3/logs/config_log

- 4: make ( failure )
    Logs:
        - stdio: https://builder.sourceware.org/buildbot/#builders/68/builds/2720/steps/4/logs/stdio
        - warnings (6): https://builder.sourceware.org/buildbot/#builders/68/builds/2720/steps/4/logs/warnings__6_

A new failure has been detected on builder binutils-fedora-x86_64 while building binutils-gdb.

Full details are available at:
    https://builder.sourceware.org/buildbot/#builders/77/builds/2700

Build state: failed compile (failure)
Revision: 06e8d9861d16c5b7e6920ad0e89889ccf45c575a
Worker: bb1-2
Build Reason: (unknown)
Blamelist: Claudiu Zissulescu <claziss@synopsys.com>

Steps:

- 0: worker_preparation ( success )

- 1: git checkout ( success )
    Logs:
        - stdio: https://builder.sourceware.org/buildbot/#builders/77/builds/2700/steps/1/logs/stdio

- 2: rm -rf binutils-build ( success )
    Logs:
        - stdio: https://builder.sourceware.org/buildbot/#builders/77/builds/2700/steps/2/logs/stdio

- 3: configure ( success )
    Logs:
        - stdio: https://builder.sourceware.org/buildbot/#builders/77/builds/2700/steps/3/logs/stdio
        - config.log: https://builder.sourceware.org/buildbot/#builders/77/builds/2700/steps/3/logs/config_log

- 4: make ( failure )
    Logs:
        - stdio: https://builder.sourceware.org/buildbot/#builders/77/builds/2700/steps/4/logs/stdio
        - warnings (8): https://builder.sourceware.org/buildbot/#builders/77/builds/2700/steps/4/logs/warnings__8_

A new failure has been detected on builder binutils-debian-ppc64 while building binutils-gdb.

Full details are available at:
    https://builder.sourceware.org/buildbot/#builders/78/builds/2678

Build state: failed compile (failure)
Revision: 06e8d9861d16c5b7e6920ad0e89889ccf45c575a
Worker: debian-ppc64
Build Reason: (unknown)
Blamelist: Claudiu Zissulescu <claziss@synopsys.com>

Steps:

- 0: worker_preparation ( success )

- 1: git checkout ( success )
    Logs:
        - stdio: https://builder.sourceware.org/buildbot/#builders/78/builds/2678/steps/1/logs/stdio

- 2: rm -rf binutils-build ( success )
    Logs:
        - stdio: https://builder.sourceware.org/buildbot/#builders/78/builds/2678/steps/2/logs/stdio

- 3: configure ( success )
    Logs:
        - stdio: https://builder.sourceware.org/buildbot/#builders/78/builds/2678/steps/3/logs/stdio
        - config.log: https://builder.sourceware.org/buildbot/#builders/78/builds/2678/steps/3/logs/config_log

- 4: make ( failure )
    Logs:
        - stdio: https://builder.sourceware.org/buildbot/#builders/78/builds/2678/steps/4/logs/stdio
        - warnings (7): https://builder.sourceware.org/buildbot/#builders/78/builds/2678/steps/4/logs/warnings__7_

A new failure has been detected on builder binutils-fedora-ppc64le while building binutils-gdb.

Full details are available at:
    https://builder.sourceware.org/buildbot/#builders/86/builds/2578

Build state: failed compile (failure)
Revision: 06e8d9861d16c5b7e6920ad0e89889ccf45c575a
Worker: fedora-ppc64le
Build Reason: (unknown)
Blamelist: Claudiu Zissulescu <claziss@synopsys.com>

Steps:

- 0: worker_preparation ( success )

- 1: git checkout ( success )
    Logs:
        - stdio: https://builder.sourceware.org/buildbot/#builders/86/builds/2578/steps/1/logs/stdio

- 2: rm -rf binutils-build ( success )
    Logs:
        - stdio: https://builder.sourceware.org/buildbot/#builders/86/builds/2578/steps/2/logs/stdio

- 3: configure ( success )
    Logs:
        - stdio: https://builder.sourceware.org/buildbot/#builders/86/builds/2578/steps/3/logs/stdio
        - config.log: https://builder.sourceware.org/buildbot/#builders/86/builds/2578/steps/3/logs/config_log

- 4: make ( failure )
    Logs:
        - stdio: https://builder.sourceware.org/buildbot/#builders/86/builds/2578/steps/4/logs/stdio
        - warnings (8): https://builder.sourceware.org/buildbot/#builders/86/builds/2578/steps/4/logs/warnings__8_

A new failure has been detected on builder binutils-opensuseleap-x86_64 while building binutils-gdb.

Full details are available at:
    https://builder.sourceware.org/buildbot/#builders/93/builds/2581

Build state: failed compile (failure)
Revision: 06e8d9861d16c5b7e6920ad0e89889ccf45c575a
Worker: bb2-1
Build Reason: (unknown)
Blamelist: Claudiu Zissulescu <claziss@synopsys.com>

Steps:

- 0: worker_preparation ( success )

- 1: git checkout ( success )
    Logs:
        - stdio: https://builder.sourceware.org/buildbot/#builders/93/builds/2581/steps/1/logs/stdio

- 2: rm -rf binutils-build ( success )
    Logs:
        - stdio: https://builder.sourceware.org/buildbot/#builders/93/builds/2581/steps/2/logs/stdio

- 3: configure ( success )
    Logs:
        - stdio: https://builder.sourceware.org/buildbot/#builders/93/builds/2581/steps/3/logs/stdio
        - config.log: https://builder.sourceware.org/buildbot/#builders/93/builds/2581/steps/3/logs/config_log

- 4: make ( failure )
    Logs:
        - stdio: https://builder.sourceware.org/buildbot/#builders/93/builds/2581/steps/4/logs/stdio
        - warnings (6): https://builder.sourceware.org/buildbot/#builders/93/builds/2581/steps/4/logs/warnings__6_

A new failure has been detected on builder binutils-opensusetw-x86_64 while building binutils-gdb.

Full details are available at:
    https://builder.sourceware.org/buildbot/#builders/102/builds/2584

Build state: failed compile (failure)
Revision: 06e8d9861d16c5b7e6920ad0e89889ccf45c575a
Worker: bb1-1
Build Reason: (unknown)
Blamelist: Claudiu Zissulescu <claziss@synopsys.com>

Steps:

- 0: worker_preparation ( success )

- 1: git checkout ( success )
    Logs:
        - stdio: https://builder.sourceware.org/buildbot/#builders/102/builds/2584/steps/1/logs/stdio

- 2: rm -rf binutils-build ( success )
    Logs:
        - stdio: https://builder.sourceware.org/buildbot/#builders/102/builds/2584/steps/2/logs/stdio

- 3: configure ( success )
    Logs:
        - stdio: https://builder.sourceware.org/buildbot/#builders/102/builds/2584/steps/3/logs/stdio
        - config.log: https://builder.sourceware.org/buildbot/#builders/102/builds/2584/steps/3/logs/config_log

- 4: make ( failure )
    Logs:
        - stdio: https://builder.sourceware.org/buildbot/#builders/102/builds/2584/steps/4/logs/stdio
        - warnings (7): https://builder.sourceware.org/buildbot/#builders/102/builds/2584/steps/4/logs/warnings__7_

A new failure has been detected on builder binutils-rawhide-x86_64 while building binutils-gdb.

Full details are available at:
    https://builder.sourceware.org/buildbot/#builders/133/builds/2436

Build state: failed compile (failure)
Revision: 06e8d9861d16c5b7e6920ad0e89889ccf45c575a
Worker: bb1-2
Build Reason: (unknown)
Blamelist: Claudiu Zissulescu <claziss@synopsys.com>

Steps:

- 0: worker_preparation ( success )

- 1: git checkout ( success )
    Logs:
        - stdio: https://builder.sourceware.org/buildbot/#builders/133/builds/2436/steps/1/logs/stdio

- 2: rm -rf binutils-build ( success )
    Logs:
        - stdio: https://builder.sourceware.org/buildbot/#builders/133/builds/2436/steps/2/logs/stdio

- 3: configure ( success )
    Logs:
        - stdio: https://builder.sourceware.org/buildbot/#builders/133/builds/2436/steps/3/logs/stdio
        - config.log: https://builder.sourceware.org/buildbot/#builders/133/builds/2436/steps/3/logs/config_log

- 4: make ( failure )
    Logs:
        - stdio: https://builder.sourceware.org/buildbot/#builders/133/builds/2436/steps/4/logs/stdio
        - warnings (8): https://builder.sourceware.org/buildbot/#builders/133/builds/2436/steps/4/logs/warnings__8_

A new failure has been detected on builder binutils-debian-testing-x86_64 while building binutils-gdb.

Full details are available at:
    https://builder.sourceware.org/buildbot/#builders/149/builds/2426

Build state: failed compile (failure)
Revision: 06e8d9861d16c5b7e6920ad0e89889ccf45c575a
Worker: bb1-1
Build Reason: (unknown)
Blamelist: Claudiu Zissulescu <claziss@synopsys.com>

Steps:

- 0: worker_preparation ( success )

- 1: git checkout ( success )
    Logs:
        - stdio: https://builder.sourceware.org/buildbot/#builders/149/builds/2426/steps/1/logs/stdio

- 2: rm -rf binutils-build ( success )
    Logs:
        - stdio: https://builder.sourceware.org/buildbot/#builders/149/builds/2426/steps/2/logs/stdio

- 3: configure ( success )
    Logs:
        - stdio: https://builder.sourceware.org/buildbot/#builders/149/builds/2426/steps/3/logs/stdio
        - config.log: https://builder.sourceware.org/buildbot/#builders/149/builds/2426/steps/3/logs/config_log

- 4: make ( failure )
    Logs:
        - stdio: https://builder.sourceware.org/buildbot/#builders/149/builds/2426/steps/4/logs/stdio
        - warnings (6): https://builder.sourceware.org/buildbot/#builders/149/builds/2426/steps/4/logs/warnings__6_

A new failure has been detected on builder binutils-ubuntu22_04-arm64 while building binutils-gdb.

Full details are available at:
    https://builder.sourceware.org/buildbot/#builders/221/builds/1447

Build state: failed compile (failure)
Revision: 06e8d9861d16c5b7e6920ad0e89889ccf45c575a
Worker: arm64-ubuntu22_04
Build Reason: (unknown)
Blamelist: Claudiu Zissulescu <claziss@synopsys.com>

Steps:

- 0: worker_preparation ( success )

- 1: git checkout ( success )
    Logs:
        - stdio: https://builder.sourceware.org/buildbot/#builders/221/builds/1447/steps/1/logs/stdio

- 2: rm -rf binutils-build ( success )
    Logs:
        - stdio: https://builder.sourceware.org/buildbot/#builders/221/builds/1447/steps/2/logs/stdio

- 3: configure ( success )
    Logs:
        - stdio: https://builder.sourceware.org/buildbot/#builders/221/builds/1447/steps/3/logs/stdio
        - config.log: https://builder.sourceware.org/buildbot/#builders/221/builds/1447/steps/3/logs/config_log

- 4: make ( failure )
    Logs:
        - stdio: https://builder.sourceware.org/buildbot/#builders/221/builds/1447/steps/4/logs/stdio
        - warnings (7): https://builder.sourceware.org/buildbot/#builders/221/builds/1447/steps/4/logs/warnings__7_

A new failure has been detected on builder binutils-ubuntu20_04-arm64 while building binutils-gdb.

Full details are available at:
    https://builder.sourceware.org/buildbot/#builders/222/builds/1447

Build state: failed compile (failure)
Revision: 06e8d9861d16c5b7e6920ad0e89889ccf45c575a
Worker: arm64-ubuntu20_04
Build Reason: (unknown)
Blamelist: Claudiu Zissulescu <claziss@synopsys.com>

Steps:

- 0: worker_preparation ( success )

- 1: git checkout ( success )
    Logs:
        - stdio: https://builder.sourceware.org/buildbot/#builders/222/builds/1447/steps/1/logs/stdio

- 2: rm -rf binutils-build ( success )
    Logs:
        - stdio: https://builder.sourceware.org/buildbot/#builders/222/builds/1447/steps/2/logs/stdio

- 3: configure ( success )
    Logs:
        - stdio: https://builder.sourceware.org/buildbot/#builders/222/builds/1447/steps/3/logs/stdio
        - config.log: https://builder.sourceware.org/buildbot/#builders/222/builds/1447/steps/3/logs/config_log

- 4: make ( failure )
    Logs:
        - stdio: https://builder.sourceware.org/buildbot/#builders/222/builds/1447/steps/4/logs/stdio
        - warnings (7): https://builder.sourceware.org/buildbot/#builders/222/builds/1447/steps/4/logs/warnings__7_

A new failure has been detected on builder binutils-gentoo-sparc while building binutils-gdb.

Full details are available at:
    https://builder.sourceware.org/buildbot/#builders/228/builds/1302

Build state: failed compile (failure)
Revision: 06e8d9861d16c5b7e6920ad0e89889ccf45c575a
Worker: gentoo-sparc
Build Reason: (unknown)
Blamelist: Claudiu Zissulescu <claziss@synopsys.com>

Steps:

- 0: worker_preparation ( success )

- 1: git checkout ( success )
    Logs:
        - stdio: https://builder.sourceware.org/buildbot/#builders/228/builds/1302/steps/1/logs/stdio

- 2: rm -rf binutils-build ( success )
    Logs:
        - stdio: https://builder.sourceware.org/buildbot/#builders/228/builds/1302/steps/2/logs/stdio

- 3: configure ( success )
    Logs:
        - stdio: https://builder.sourceware.org/buildbot/#builders/228/builds/1302/steps/3/logs/stdio
        - config.log: https://builder.sourceware.org/buildbot/#builders/228/builds/1302/steps/3/logs/config_log

- 4: make ( failure )
    Logs:
        - stdio: https://builder.sourceware.org/buildbot/#builders/228/builds/1302/steps/4/logs/stdio
        - warnings (7): https://builder.sourceware.org/buildbot/#builders/228/builds/1302/steps/4/logs/warnings__7_


^ permalink raw reply	[flat|nested] 29+ messages in thread

* ☠ Buildbot (Sourceware): binutils-gdb - failed compile (failure) (master)
@ 2023-08-02  9:02 builder
  0 siblings, 0 replies; 29+ messages in thread
From: builder @ 2023-08-02  9:02 UTC (permalink / raw)
  To: binutils

A new failure has been detected on builder binutils-debian-amd64 while building binutils-gdb.

Full details are available at:
    https://builder.sourceware.org/buildbot/#builders/68/builds/2476

Build state: failed compile (failure)
Revision: 675b9d612cc59446e84e2c6d89b45500cb603a8d
Worker: bb2-1
Build Reason: (unknown)
Blamelist: Khem Raj <raj.khem@gmail.com>, Nick Clifton <nickc@redhat.com>

Steps:

- 0: worker_preparation ( success )

- 1: git checkout ( success )
    Logs:
        - stdio: https://builder.sourceware.org/buildbot/#builders/68/builds/2476/steps/1/logs/stdio

- 2: rm -rf binutils-build ( success )
    Logs:
        - stdio: https://builder.sourceware.org/buildbot/#builders/68/builds/2476/steps/2/logs/stdio

- 3: configure ( success )
    Logs:
        - stdio: https://builder.sourceware.org/buildbot/#builders/68/builds/2476/steps/3/logs/stdio
        - config.log: https://builder.sourceware.org/buildbot/#builders/68/builds/2476/steps/3/logs/config_log

- 4: make ( failure )
    Logs:
        - stdio: https://builder.sourceware.org/buildbot/#builders/68/builds/2476/steps/4/logs/stdio
        - warnings (6): https://builder.sourceware.org/buildbot/#builders/68/builds/2476/steps/4/logs/warnings__6_

A new failure has been detected on builder binutils-fedora-x86_64 while building binutils-gdb.

Full details are available at:
    https://builder.sourceware.org/buildbot/#builders/77/builds/2456

Build state: failed compile (failure)
Revision: 675b9d612cc59446e84e2c6d89b45500cb603a8d
Worker: bb1-1
Build Reason: (unknown)
Blamelist: Khem Raj <raj.khem@gmail.com>, Nick Clifton <nickc@redhat.com>

Steps:

- 0: worker_preparation ( success )

- 1: git checkout ( success )
    Logs:
        - stdio: https://builder.sourceware.org/buildbot/#builders/77/builds/2456/steps/1/logs/stdio

- 2: rm -rf binutils-build ( success )
    Logs:
        - stdio: https://builder.sourceware.org/buildbot/#builders/77/builds/2456/steps/2/logs/stdio

- 3: configure ( success )
    Logs:
        - stdio: https://builder.sourceware.org/buildbot/#builders/77/builds/2456/steps/3/logs/stdio
        - config.log: https://builder.sourceware.org/buildbot/#builders/77/builds/2456/steps/3/logs/config_log

- 4: make ( failure )
    Logs:
        - stdio: https://builder.sourceware.org/buildbot/#builders/77/builds/2456/steps/4/logs/stdio
        - warnings (8): https://builder.sourceware.org/buildbot/#builders/77/builds/2456/steps/4/logs/warnings__8_

A new failure has been detected on builder binutils-debian-ppc64 while building binutils-gdb.

Full details are available at:
    https://builder.sourceware.org/buildbot/#builders/78/builds/2433

Build state: failed compile (failure)
Revision: 675b9d612cc59446e84e2c6d89b45500cb603a8d
Worker: debian-ppc64
Build Reason: (unknown)
Blamelist: Khem Raj <raj.khem@gmail.com>, Nick Clifton <nickc@redhat.com>

Steps:

- 0: worker_preparation ( success )

- 1: git checkout ( success )
    Logs:
        - stdio: https://builder.sourceware.org/buildbot/#builders/78/builds/2433/steps/1/logs/stdio

- 2: rm -rf binutils-build ( success )
    Logs:
        - stdio: https://builder.sourceware.org/buildbot/#builders/78/builds/2433/steps/2/logs/stdio

- 3: configure ( success )
    Logs:
        - stdio: https://builder.sourceware.org/buildbot/#builders/78/builds/2433/steps/3/logs/stdio
        - config.log: https://builder.sourceware.org/buildbot/#builders/78/builds/2433/steps/3/logs/config_log

- 4: make ( failure )
    Logs:
        - stdio: https://builder.sourceware.org/buildbot/#builders/78/builds/2433/steps/4/logs/stdio
        - warnings (7): https://builder.sourceware.org/buildbot/#builders/78/builds/2433/steps/4/logs/warnings__7_

A new failure has been detected on builder binutils-fedora-ppc64le while building binutils-gdb.

Full details are available at:
    https://builder.sourceware.org/buildbot/#builders/86/builds/2334

Build state: failed compile (failure)
Revision: 675b9d612cc59446e84e2c6d89b45500cb603a8d
Worker: fedora-ppc64le
Build Reason: (unknown)
Blamelist: Khem Raj <raj.khem@gmail.com>, Nick Clifton <nickc@redhat.com>

Steps:

- 0: worker_preparation ( success )

- 1: git checkout ( success )
    Logs:
        - stdio: https://builder.sourceware.org/buildbot/#builders/86/builds/2334/steps/1/logs/stdio

- 2: rm -rf binutils-build ( success )
    Logs:
        - stdio: https://builder.sourceware.org/buildbot/#builders/86/builds/2334/steps/2/logs/stdio

- 3: configure ( success )
    Logs:
        - stdio: https://builder.sourceware.org/buildbot/#builders/86/builds/2334/steps/3/logs/stdio
        - config.log: https://builder.sourceware.org/buildbot/#builders/86/builds/2334/steps/3/logs/config_log

- 4: make ( failure )
    Logs:
        - stdio: https://builder.sourceware.org/buildbot/#builders/86/builds/2334/steps/4/logs/stdio
        - warnings (8): https://builder.sourceware.org/buildbot/#builders/86/builds/2334/steps/4/logs/warnings__8_

A new failure has been detected on builder binutils-opensuseleap-x86_64 while building binutils-gdb.

Full details are available at:
    https://builder.sourceware.org/buildbot/#builders/93/builds/2337

Build state: failed compile (failure)
Revision: 675b9d612cc59446e84e2c6d89b45500cb603a8d
Worker: bb2-1
Build Reason: (unknown)
Blamelist: Khem Raj <raj.khem@gmail.com>, Nick Clifton <nickc@redhat.com>

Steps:

- 0: worker_preparation ( success )

- 1: git checkout ( success )
    Logs:
        - stdio: https://builder.sourceware.org/buildbot/#builders/93/builds/2337/steps/1/logs/stdio

- 2: rm -rf binutils-build ( success )
    Logs:
        - stdio: https://builder.sourceware.org/buildbot/#builders/93/builds/2337/steps/2/logs/stdio

- 3: configure ( success )
    Logs:
        - stdio: https://builder.sourceware.org/buildbot/#builders/93/builds/2337/steps/3/logs/stdio
        - config.log: https://builder.sourceware.org/buildbot/#builders/93/builds/2337/steps/3/logs/config_log

- 4: make ( failure )
    Logs:
        - stdio: https://builder.sourceware.org/buildbot/#builders/93/builds/2337/steps/4/logs/stdio
        - warnings (14): https://builder.sourceware.org/buildbot/#builders/93/builds/2337/steps/4/logs/warnings__14_

A new failure has been detected on builder binutils-opensusetw-x86_64 while building binutils-gdb.

Full details are available at:
    https://builder.sourceware.org/buildbot/#builders/102/builds/2339

Build state: failed compile (failure)
Revision: 675b9d612cc59446e84e2c6d89b45500cb603a8d
Worker: bb1-2
Build Reason: (unknown)
Blamelist: Khem Raj <raj.khem@gmail.com>, Nick Clifton <nickc@redhat.com>

Steps:

- 0: worker_preparation ( success )

- 1: git checkout ( success )
    Logs:
        - stdio: https://builder.sourceware.org/buildbot/#builders/102/builds/2339/steps/1/logs/stdio

- 2: rm -rf binutils-build ( success )
    Logs:
        - stdio: https://builder.sourceware.org/buildbot/#builders/102/builds/2339/steps/2/logs/stdio

- 3: configure ( success )
    Logs:
        - stdio: https://builder.sourceware.org/buildbot/#builders/102/builds/2339/steps/3/logs/stdio
        - config.log: https://builder.sourceware.org/buildbot/#builders/102/builds/2339/steps/3/logs/config_log

- 4: make ( failure )
    Logs:
        - stdio: https://builder.sourceware.org/buildbot/#builders/102/builds/2339/steps/4/logs/stdio
        - warnings (7): https://builder.sourceware.org/buildbot/#builders/102/builds/2339/steps/4/logs/warnings__7_

A new failure has been detected on builder binutils-rawhide-x86_64 while building binutils-gdb.

Full details are available at:
    https://builder.sourceware.org/buildbot/#builders/133/builds/2192

Build state: failed compile (failure)
Revision: 675b9d612cc59446e84e2c6d89b45500cb603a8d
Worker: bb1-1
Build Reason: (unknown)
Blamelist: Khem Raj <raj.khem@gmail.com>, Nick Clifton <nickc@redhat.com>

Steps:

- 0: worker_preparation ( success )

- 1: git checkout ( success )
    Logs:
        - stdio: https://builder.sourceware.org/buildbot/#builders/133/builds/2192/steps/1/logs/stdio

- 2: rm -rf binutils-build ( success )
    Logs:
        - stdio: https://builder.sourceware.org/buildbot/#builders/133/builds/2192/steps/2/logs/stdio

- 3: configure ( success )
    Logs:
        - stdio: https://builder.sourceware.org/buildbot/#builders/133/builds/2192/steps/3/logs/stdio
        - config.log: https://builder.sourceware.org/buildbot/#builders/133/builds/2192/steps/3/logs/config_log

- 4: make ( failure )
    Logs:
        - stdio: https://builder.sourceware.org/buildbot/#builders/133/builds/2192/steps/4/logs/stdio
        - warnings (8): https://builder.sourceware.org/buildbot/#builders/133/builds/2192/steps/4/logs/warnings__8_

A new failure has been detected on builder binutils-debian-testing-x86_64 while building binutils-gdb.

Full details are available at:
    https://builder.sourceware.org/buildbot/#builders/149/builds/2182

Build state: failed compile (failure)
Revision: 675b9d612cc59446e84e2c6d89b45500cb603a8d
Worker: bb1-1
Build Reason: (unknown)
Blamelist: Khem Raj <raj.khem@gmail.com>, Nick Clifton <nickc@redhat.com>

Steps:

- 0: worker_preparation ( success )

- 1: git checkout ( success )
    Logs:
        - stdio: https://builder.sourceware.org/buildbot/#builders/149/builds/2182/steps/1/logs/stdio

- 2: rm -rf binutils-build ( success )
    Logs:
        - stdio: https://builder.sourceware.org/buildbot/#builders/149/builds/2182/steps/2/logs/stdio

- 3: configure ( success )
    Logs:
        - stdio: https://builder.sourceware.org/buildbot/#builders/149/builds/2182/steps/3/logs/stdio
        - config.log: https://builder.sourceware.org/buildbot/#builders/149/builds/2182/steps/3/logs/config_log

- 4: make ( failure )
    Logs:
        - stdio: https://builder.sourceware.org/buildbot/#builders/149/builds/2182/steps/4/logs/stdio
        - warnings (6): https://builder.sourceware.org/buildbot/#builders/149/builds/2182/steps/4/logs/warnings__6_

A new failure has been detected on builder binutils-ubuntu22_04-arm64 while building binutils-gdb.

Full details are available at:
    https://builder.sourceware.org/buildbot/#builders/221/builds/1202

Build state: failed compile (failure)
Revision: 675b9d612cc59446e84e2c6d89b45500cb603a8d
Worker: arm64-ubuntu22_04
Build Reason: (unknown)
Blamelist: Khem Raj <raj.khem@gmail.com>, Nick Clifton <nickc@redhat.com>

Steps:

- 0: worker_preparation ( success )

- 1: git checkout ( success )
    Logs:
        - stdio: https://builder.sourceware.org/buildbot/#builders/221/builds/1202/steps/1/logs/stdio

- 2: rm -rf binutils-build ( success )
    Logs:
        - stdio: https://builder.sourceware.org/buildbot/#builders/221/builds/1202/steps/2/logs/stdio

- 3: configure ( success )
    Logs:
        - stdio: https://builder.sourceware.org/buildbot/#builders/221/builds/1202/steps/3/logs/stdio
        - config.log: https://builder.sourceware.org/buildbot/#builders/221/builds/1202/steps/3/logs/config_log

- 4: make ( failure )
    Logs:
        - stdio: https://builder.sourceware.org/buildbot/#builders/221/builds/1202/steps/4/logs/stdio
        - warnings (7): https://builder.sourceware.org/buildbot/#builders/221/builds/1202/steps/4/logs/warnings__7_

A new failure has been detected on builder binutils-ubuntu20_04-arm64 while building binutils-gdb.

Full details are available at:
    https://builder.sourceware.org/buildbot/#builders/222/builds/1202

Build state: failed compile (failure)
Revision: 675b9d612cc59446e84e2c6d89b45500cb603a8d
Worker: arm64-ubuntu20_04
Build Reason: (unknown)
Blamelist: Khem Raj <raj.khem@gmail.com>, Nick Clifton <nickc@redhat.com>

Steps:

- 0: worker_preparation ( success )

- 1: git checkout ( success )
    Logs:
        - stdio: https://builder.sourceware.org/buildbot/#builders/222/builds/1202/steps/1/logs/stdio

- 2: rm -rf binutils-build ( success )
    Logs:
        - stdio: https://builder.sourceware.org/buildbot/#builders/222/builds/1202/steps/2/logs/stdio

- 3: configure ( success )
    Logs:
        - stdio: https://builder.sourceware.org/buildbot/#builders/222/builds/1202/steps/3/logs/stdio
        - config.log: https://builder.sourceware.org/buildbot/#builders/222/builds/1202/steps/3/logs/config_log

- 4: make ( failure )
    Logs:
        - stdio: https://builder.sourceware.org/buildbot/#builders/222/builds/1202/steps/4/logs/stdio
        - warnings (15): https://builder.sourceware.org/buildbot/#builders/222/builds/1202/steps/4/logs/warnings__15_

A new failure has been detected on builder binutils-gentoo-sparc while building binutils-gdb.

Full details are available at:
    https://builder.sourceware.org/buildbot/#builders/228/builds/1057

Build state: failed compile (failure)
Revision: 675b9d612cc59446e84e2c6d89b45500cb603a8d
Worker: gentoo-sparc
Build Reason: (unknown)
Blamelist: Khem Raj <raj.khem@gmail.com>, Nick Clifton <nickc@redhat.com>

Steps:

- 0: worker_preparation ( success )

- 1: git checkout ( success )
    Logs:
        - stdio: https://builder.sourceware.org/buildbot/#builders/228/builds/1057/steps/1/logs/stdio

- 2: rm -rf binutils-build ( success )
    Logs:
        - stdio: https://builder.sourceware.org/buildbot/#builders/228/builds/1057/steps/2/logs/stdio

- 3: configure ( success )
    Logs:
        - stdio: https://builder.sourceware.org/buildbot/#builders/228/builds/1057/steps/3/logs/stdio
        - config.log: https://builder.sourceware.org/buildbot/#builders/228/builds/1057/steps/3/logs/config_log

- 4: make ( failure )
    Logs:
        - stdio: https://builder.sourceware.org/buildbot/#builders/228/builds/1057/steps/4/logs/stdio
        - warnings (7): https://builder.sourceware.org/buildbot/#builders/228/builds/1057/steps/4/logs/warnings__7_


^ permalink raw reply	[flat|nested] 29+ messages in thread

* ☠ Buildbot (Sourceware): binutils-gdb - failed compile (failure) (master)
@ 2023-07-27 14:32 builder
  0 siblings, 0 replies; 29+ messages in thread
From: builder @ 2023-07-27 14:32 UTC (permalink / raw)
  To: binutils

A new failure has been detected on builder binutils-debian-armhf while building binutils-gdb.

Full details are available at:
    https://builder.sourceware.org/buildbot/#builders/80/builds/1833

Build state: failed compile (failure)
Revision: cd2908958ace351831cea7acc87e68a93f395bc6
Worker: debian-armhf
Build Reason: (unknown)
Blamelist: Haochen Jiang <haochen.jiang@intel.com>, Hu, Lin1 <lin1.hu@intel.com>

Steps:

- 0: worker_preparation ( success )

- 1: git checkout ( success )
    Logs:
        - stdio: https://builder.sourceware.org/buildbot/#builders/80/builds/1833/steps/1/logs/stdio

- 2: rm -rf binutils-build ( success )
    Logs:
        - stdio: https://builder.sourceware.org/buildbot/#builders/80/builds/1833/steps/2/logs/stdio

- 3: configure ( success )
    Logs:
        - stdio: https://builder.sourceware.org/buildbot/#builders/80/builds/1833/steps/3/logs/stdio
        - config.log: https://builder.sourceware.org/buildbot/#builders/80/builds/1833/steps/3/logs/config_log

- 4: make ( failure )
    Logs:
        - stdio: https://builder.sourceware.org/buildbot/#builders/80/builds/1833/steps/4/logs/stdio
        - warnings (36): https://builder.sourceware.org/buildbot/#builders/80/builds/1833/steps/4/logs/warnings__36_


^ permalink raw reply	[flat|nested] 29+ messages in thread

* ☠ Buildbot (Sourceware): binutils-gdb - failed compile (failure) (master)
@ 2023-07-21 12:06 builder
  0 siblings, 0 replies; 29+ messages in thread
From: builder @ 2023-07-21 12:06 UTC (permalink / raw)
  To: binutils

A new failure has been detected on builder binutils-debian-amd64 while building binutils-gdb.

Full details are available at:
    https://builder.sourceware.org/buildbot/#builders/68/builds/2394

Build state: failed compile (failure)
Revision: d218e7fedc74d67837d2134120917f4ac877454c
Worker: bb1-1
Build Reason: (unknown)
Blamelist: Jose E. Marchesi <jose.marchesi@oracle.com>, Lancelot Six <lancelot.six@amd.com>

Steps:

- 0: worker_preparation ( success )

- 1: git checkout ( success )
    Logs:
        - stdio: https://builder.sourceware.org/buildbot/#builders/68/builds/2394/steps/1/logs/stdio

- 2: rm -rf binutils-build ( success )
    Logs:
        - stdio: https://builder.sourceware.org/buildbot/#builders/68/builds/2394/steps/2/logs/stdio

- 3: configure ( success )
    Logs:
        - stdio: https://builder.sourceware.org/buildbot/#builders/68/builds/2394/steps/3/logs/stdio
        - config.log: https://builder.sourceware.org/buildbot/#builders/68/builds/2394/steps/3/logs/config_log

- 4: make ( failure )
    Logs:
        - stdio: https://builder.sourceware.org/buildbot/#builders/68/builds/2394/steps/4/logs/stdio
        - warnings (18): https://builder.sourceware.org/buildbot/#builders/68/builds/2394/steps/4/logs/warnings__18_

A new failure has been detected on builder binutils-fedora-x86_64 while building binutils-gdb.

Full details are available at:
    https://builder.sourceware.org/buildbot/#builders/77/builds/2374

Build state: failed compile (failure)
Revision: d218e7fedc74d67837d2134120917f4ac877454c
Worker: bb2-1
Build Reason: (unknown)
Blamelist: Jose E. Marchesi <jose.marchesi@oracle.com>, Lancelot Six <lancelot.six@amd.com>

Steps:

- 0: worker_preparation ( success )

- 1: git checkout ( success )
    Logs:
        - stdio: https://builder.sourceware.org/buildbot/#builders/77/builds/2374/steps/1/logs/stdio

- 2: rm -rf binutils-build ( success )
    Logs:
        - stdio: https://builder.sourceware.org/buildbot/#builders/77/builds/2374/steps/2/logs/stdio

- 3: configure ( success )
    Logs:
        - stdio: https://builder.sourceware.org/buildbot/#builders/77/builds/2374/steps/3/logs/stdio
        - config.log: https://builder.sourceware.org/buildbot/#builders/77/builds/2374/steps/3/logs/config_log

- 4: make ( failure )
    Logs:
        - stdio: https://builder.sourceware.org/buildbot/#builders/77/builds/2374/steps/4/logs/stdio
        - warnings (60): https://builder.sourceware.org/buildbot/#builders/77/builds/2374/steps/4/logs/warnings__60_

A new failure has been detected on builder binutils-debian-ppc64 while building binutils-gdb.

Full details are available at:
    https://builder.sourceware.org/buildbot/#builders/78/builds/2351

Build state: failed compile (failure)
Revision: d218e7fedc74d67837d2134120917f4ac877454c
Worker: debian-ppc64
Build Reason: (unknown)
Blamelist: Jose E. Marchesi <jose.marchesi@oracle.com>, Lancelot Six <lancelot.six@amd.com>

Steps:

- 0: worker_preparation ( success )

- 1: git checkout ( success )
    Logs:
        - stdio: https://builder.sourceware.org/buildbot/#builders/78/builds/2351/steps/1/logs/stdio

- 2: rm -rf binutils-build ( success )
    Logs:
        - stdio: https://builder.sourceware.org/buildbot/#builders/78/builds/2351/steps/2/logs/stdio

- 3: configure ( success )
    Logs:
        - stdio: https://builder.sourceware.org/buildbot/#builders/78/builds/2351/steps/3/logs/stdio
        - config.log: https://builder.sourceware.org/buildbot/#builders/78/builds/2351/steps/3/logs/config_log

- 4: make ( failure )
    Logs:
        - stdio: https://builder.sourceware.org/buildbot/#builders/78/builds/2351/steps/4/logs/stdio
        - warnings (7): https://builder.sourceware.org/buildbot/#builders/78/builds/2351/steps/4/logs/warnings__7_

A new failure has been detected on builder binutils-fedora-ppc64le while building binutils-gdb.

Full details are available at:
    https://builder.sourceware.org/buildbot/#builders/86/builds/2252

Build state: failed compile (failure)
Revision: d218e7fedc74d67837d2134120917f4ac877454c
Worker: fedora-ppc64le
Build Reason: (unknown)
Blamelist: Jose E. Marchesi <jose.marchesi@oracle.com>, Lancelot Six <lancelot.six@amd.com>

Steps:

- 0: worker_preparation ( success )

- 1: git checkout ( success )
    Logs:
        - stdio: https://builder.sourceware.org/buildbot/#builders/86/builds/2252/steps/1/logs/stdio

- 2: rm -rf binutils-build ( success )
    Logs:
        - stdio: https://builder.sourceware.org/buildbot/#builders/86/builds/2252/steps/2/logs/stdio

- 3: configure ( success )
    Logs:
        - stdio: https://builder.sourceware.org/buildbot/#builders/86/builds/2252/steps/3/logs/stdio
        - config.log: https://builder.sourceware.org/buildbot/#builders/86/builds/2252/steps/3/logs/config_log

- 4: make ( failure )
    Logs:
        - stdio: https://builder.sourceware.org/buildbot/#builders/86/builds/2252/steps/4/logs/stdio
        - warnings (8): https://builder.sourceware.org/buildbot/#builders/86/builds/2252/steps/4/logs/warnings__8_

A new failure has been detected on builder binutils-opensuseleap-x86_64 while building binutils-gdb.

Full details are available at:
    https://builder.sourceware.org/buildbot/#builders/93/builds/2255

Build state: failed compile (failure)
Revision: d218e7fedc74d67837d2134120917f4ac877454c
Worker: bb1-1
Build Reason: (unknown)
Blamelist: Jose E. Marchesi <jose.marchesi@oracle.com>, Lancelot Six <lancelot.six@amd.com>

Steps:

- 0: worker_preparation ( success )

- 1: git checkout ( success )
    Logs:
        - stdio: https://builder.sourceware.org/buildbot/#builders/93/builds/2255/steps/1/logs/stdio

- 2: rm -rf binutils-build ( success )
    Logs:
        - stdio: https://builder.sourceware.org/buildbot/#builders/93/builds/2255/steps/2/logs/stdio

- 3: configure ( success )
    Logs:
        - stdio: https://builder.sourceware.org/buildbot/#builders/93/builds/2255/steps/3/logs/stdio
        - config.log: https://builder.sourceware.org/buildbot/#builders/93/builds/2255/steps/3/logs/config_log

- 4: make ( failure )
    Logs:
        - stdio: https://builder.sourceware.org/buildbot/#builders/93/builds/2255/steps/4/logs/stdio
        - warnings (63): https://builder.sourceware.org/buildbot/#builders/93/builds/2255/steps/4/logs/warnings__63_

A new failure has been detected on builder binutils-opensusetw-x86_64 while building binutils-gdb.

Full details are available at:
    https://builder.sourceware.org/buildbot/#builders/102/builds/2255

Build state: failed compile (failure)
Revision: d218e7fedc74d67837d2134120917f4ac877454c
Worker: bb1-2
Build Reason: (unknown)
Blamelist: Jose E. Marchesi <jose.marchesi@oracle.com>, Lancelot Six <lancelot.six@amd.com>

Steps:

- 0: worker_preparation ( success )

- 1: git checkout ( success )
    Logs:
        - stdio: https://builder.sourceware.org/buildbot/#builders/102/builds/2255/steps/1/logs/stdio

- 2: rm -rf binutils-build ( success )
    Logs:
        - stdio: https://builder.sourceware.org/buildbot/#builders/102/builds/2255/steps/2/logs/stdio

- 3: configure ( success )
    Logs:
        - stdio: https://builder.sourceware.org/buildbot/#builders/102/builds/2255/steps/3/logs/stdio
        - config.log: https://builder.sourceware.org/buildbot/#builders/102/builds/2255/steps/3/logs/config_log

- 4: make ( failure )
    Logs:
        - stdio: https://builder.sourceware.org/buildbot/#builders/102/builds/2255/steps/4/logs/stdio
        - warnings (59): https://builder.sourceware.org/buildbot/#builders/102/builds/2255/steps/4/logs/warnings__59_

A new failure has been detected on builder binutils-rawhide-x86_64 while building binutils-gdb.

Full details are available at:
    https://builder.sourceware.org/buildbot/#builders/133/builds/2110

Build state: failed compile (failure)
Revision: d218e7fedc74d67837d2134120917f4ac877454c
Worker: bb2-2
Build Reason: (unknown)
Blamelist: Jose E. Marchesi <jose.marchesi@oracle.com>, Lancelot Six <lancelot.six@amd.com>

Steps:

- 0: worker_preparation ( success )

- 1: git checkout ( success )
    Logs:
        - stdio: https://builder.sourceware.org/buildbot/#builders/133/builds/2110/steps/1/logs/stdio

- 2: rm -rf binutils-build ( success )
    Logs:
        - stdio: https://builder.sourceware.org/buildbot/#builders/133/builds/2110/steps/2/logs/stdio

- 3: configure ( success )
    Logs:
        - stdio: https://builder.sourceware.org/buildbot/#builders/133/builds/2110/steps/3/logs/stdio
        - config.log: https://builder.sourceware.org/buildbot/#builders/133/builds/2110/steps/3/logs/config_log

- 4: make ( failure )
    Logs:
        - stdio: https://builder.sourceware.org/buildbot/#builders/133/builds/2110/steps/4/logs/stdio
        - warnings (60): https://builder.sourceware.org/buildbot/#builders/133/builds/2110/steps/4/logs/warnings__60_

A new failure has been detected on builder binutils-debian-testing-x86_64 while building binutils-gdb.

Full details are available at:
    https://builder.sourceware.org/buildbot/#builders/149/builds/2100

Build state: failed compile (failure)
Revision: d218e7fedc74d67837d2134120917f4ac877454c
Worker: bb2-2
Build Reason: (unknown)
Blamelist: Jose E. Marchesi <jose.marchesi@oracle.com>, Lancelot Six <lancelot.six@amd.com>

Steps:

- 0: worker_preparation ( success )

- 1: git checkout ( success )
    Logs:
        - stdio: https://builder.sourceware.org/buildbot/#builders/149/builds/2100/steps/1/logs/stdio

- 2: rm -rf binutils-build ( success )
    Logs:
        - stdio: https://builder.sourceware.org/buildbot/#builders/149/builds/2100/steps/2/logs/stdio

- 3: configure ( success )
    Logs:
        - stdio: https://builder.sourceware.org/buildbot/#builders/149/builds/2100/steps/3/logs/stdio
        - config.log: https://builder.sourceware.org/buildbot/#builders/149/builds/2100/steps/3/logs/config_log

- 4: make ( failure )
    Logs:
        - stdio: https://builder.sourceware.org/buildbot/#builders/149/builds/2100/steps/4/logs/stdio
        - warnings (18): https://builder.sourceware.org/buildbot/#builders/149/builds/2100/steps/4/logs/warnings__18_

A new failure has been detected on builder binutils-ubuntu22_04-arm64 while building binutils-gdb.

Full details are available at:
    https://builder.sourceware.org/buildbot/#builders/221/builds/1119

Build state: failed compile (failure)
Revision: d218e7fedc74d67837d2134120917f4ac877454c
Worker: arm64-ubuntu22_04
Build Reason: (unknown)
Blamelist: Jose E. Marchesi <jose.marchesi@oracle.com>, Lancelot Six <lancelot.six@amd.com>

Steps:

- 0: worker_preparation ( success )

- 1: git checkout ( success )
    Logs:
        - stdio: https://builder.sourceware.org/buildbot/#builders/221/builds/1119/steps/1/logs/stdio

- 2: rm -rf binutils-build ( success )
    Logs:
        - stdio: https://builder.sourceware.org/buildbot/#builders/221/builds/1119/steps/2/logs/stdio

- 3: configure ( success )
    Logs:
        - stdio: https://builder.sourceware.org/buildbot/#builders/221/builds/1119/steps/3/logs/stdio
        - config.log: https://builder.sourceware.org/buildbot/#builders/221/builds/1119/steps/3/logs/config_log

- 4: make ( failure )
    Logs:
        - stdio: https://builder.sourceware.org/buildbot/#builders/221/builds/1119/steps/4/logs/stdio
        - warnings (7): https://builder.sourceware.org/buildbot/#builders/221/builds/1119/steps/4/logs/warnings__7_

A new failure has been detected on builder binutils-ubuntu20_04-arm64 while building binutils-gdb.

Full details are available at:
    https://builder.sourceware.org/buildbot/#builders/222/builds/1119

Build state: failed compile (failure)
Revision: d218e7fedc74d67837d2134120917f4ac877454c
Worker: arm64-ubuntu20_04
Build Reason: (unknown)
Blamelist: Jose E. Marchesi <jose.marchesi@oracle.com>, Lancelot Six <lancelot.six@amd.com>

Steps:

- 0: worker_preparation ( success )

- 1: git checkout ( success )
    Logs:
        - stdio: https://builder.sourceware.org/buildbot/#builders/222/builds/1119/steps/1/logs/stdio

- 2: rm -rf binutils-build ( success )
    Logs:
        - stdio: https://builder.sourceware.org/buildbot/#builders/222/builds/1119/steps/2/logs/stdio

- 3: configure ( success )
    Logs:
        - stdio: https://builder.sourceware.org/buildbot/#builders/222/builds/1119/steps/3/logs/stdio
        - config.log: https://builder.sourceware.org/buildbot/#builders/222/builds/1119/steps/3/logs/config_log

- 4: make ( failure )
    Logs:
        - stdio: https://builder.sourceware.org/buildbot/#builders/222/builds/1119/steps/4/logs/stdio
        - warnings (15): https://builder.sourceware.org/buildbot/#builders/222/builds/1119/steps/4/logs/warnings__15_


^ permalink raw reply	[flat|nested] 29+ messages in thread

* ☠ Buildbot (Sourceware): binutils-gdb - failed compile (failure) (master)
@ 2023-07-19  0:43 builder
  0 siblings, 0 replies; 29+ messages in thread
From: builder @ 2023-07-19  0:43 UTC (permalink / raw)
  To: binutils

A new failure has been detected on builder binutils-gentoo-sparc while building binutils-gdb.

Full details are available at:
    https://builder.sourceware.org/buildbot/#builders/228/builds/1042

Build state: failed compile (failure)
Revision: 057d00baa69799100553a395098fd9c2ee24b462
Worker: gentoo-sparc
Build Reason: (unknown)
Blamelist: GDB Administrator <gdbadmin@sourceware.org>

Steps:

- 0: worker_preparation ( success )

- 1: git checkout ( success )
    Logs:
        - stdio: https://builder.sourceware.org/buildbot/#builders/228/builds/1042/steps/1/logs/stdio

- 2: rm -rf binutils-build ( success )
    Logs:
        - stdio: https://builder.sourceware.org/buildbot/#builders/228/builds/1042/steps/2/logs/stdio

- 3: configure ( success )
    Logs:
        - stdio: https://builder.sourceware.org/buildbot/#builders/228/builds/1042/steps/3/logs/stdio
        - config.log: https://builder.sourceware.org/buildbot/#builders/228/builds/1042/steps/3/logs/config_log

- 4: make ( failure )
    Logs:
        - stdio: https://builder.sourceware.org/buildbot/#builders/228/builds/1042/steps/4/logs/stdio


^ permalink raw reply	[flat|nested] 29+ messages in thread

* ☠ Buildbot (Sourceware): binutils-gdb - failed compile (failure) (master)
@ 2023-05-26  9:02 builder
  0 siblings, 0 replies; 29+ messages in thread
From: builder @ 2023-05-26  9:02 UTC (permalink / raw)
  To: binutils

A new failure has been detected on builder binutils-debian-amd64 while building binutils-gdb.

Full details are available at:
    https://builder.sourceware.org/buildbot/#builders/68/builds/2092

Build state: failed compile (failure)
Revision: 1a3b4f90bc5fa5e71df1db8e663f76e262f3134d
Worker: bb1-1
Build Reason: (unknown)
Blamelist: Jan Beulich <jbeulich@suse.com>

Steps:

- 0: worker_preparation ( success )

- 1: git checkout ( success )
    Logs:
        - stdio: https://builder.sourceware.org/buildbot/#builders/68/builds/2092/steps/1/logs/stdio

- 2: rm -rf binutils-build ( success )
    Logs:
        - stdio: https://builder.sourceware.org/buildbot/#builders/68/builds/2092/steps/2/logs/stdio

- 3: configure ( success )
    Logs:
        - stdio: https://builder.sourceware.org/buildbot/#builders/68/builds/2092/steps/3/logs/stdio
        - config.log: https://builder.sourceware.org/buildbot/#builders/68/builds/2092/steps/3/logs/config_log

- 4: make ( failure )
    Logs:
        - stdio: https://builder.sourceware.org/buildbot/#builders/68/builds/2092/steps/4/logs/stdio
        - warnings (14): https://builder.sourceware.org/buildbot/#builders/68/builds/2092/steps/4/logs/warnings__14_

A new failure has been detected on builder binutils-fedora-x86_64 while building binutils-gdb.

Full details are available at:
    https://builder.sourceware.org/buildbot/#builders/77/builds/2076

Build state: failed compile (failure)
Revision: 1a3b4f90bc5fa5e71df1db8e663f76e262f3134d
Worker: bb1-1
Build Reason: (unknown)
Blamelist: Jan Beulich <jbeulich@suse.com>

Steps:

- 0: worker_preparation ( success )

- 1: git checkout ( success )
    Logs:
        - stdio: https://builder.sourceware.org/buildbot/#builders/77/builds/2076/steps/1/logs/stdio

- 2: rm -rf binutils-build ( success )
    Logs:
        - stdio: https://builder.sourceware.org/buildbot/#builders/77/builds/2076/steps/2/logs/stdio

- 3: configure ( success )
    Logs:
        - stdio: https://builder.sourceware.org/buildbot/#builders/77/builds/2076/steps/3/logs/stdio
        - config.log: https://builder.sourceware.org/buildbot/#builders/77/builds/2076/steps/3/logs/config_log

- 4: make ( failure )
    Logs:
        - stdio: https://builder.sourceware.org/buildbot/#builders/77/builds/2076/steps/4/logs/stdio
        - warnings (8): https://builder.sourceware.org/buildbot/#builders/77/builds/2076/steps/4/logs/warnings__8_

A new failure has been detected on builder binutils-debian-ppc64 while building binutils-gdb.

Full details are available at:
    https://builder.sourceware.org/buildbot/#builders/78/builds/2052

Build state: failed compile (failure)
Revision: 1a3b4f90bc5fa5e71df1db8e663f76e262f3134d
Worker: debian-ppc64
Build Reason: (unknown)
Blamelist: Jan Beulich <jbeulich@suse.com>

Steps:

- 0: worker_preparation ( success )

- 1: git checkout ( success )
    Logs:
        - stdio: https://builder.sourceware.org/buildbot/#builders/78/builds/2052/steps/1/logs/stdio

- 2: rm -rf binutils-build ( success )
    Logs:
        - stdio: https://builder.sourceware.org/buildbot/#builders/78/builds/2052/steps/2/logs/stdio

- 3: configure ( success )
    Logs:
        - stdio: https://builder.sourceware.org/buildbot/#builders/78/builds/2052/steps/3/logs/stdio
        - config.log: https://builder.sourceware.org/buildbot/#builders/78/builds/2052/steps/3/logs/config_log

- 4: make ( failure )
    Logs:
        - stdio: https://builder.sourceware.org/buildbot/#builders/78/builds/2052/steps/4/logs/stdio
        - warnings (7): https://builder.sourceware.org/buildbot/#builders/78/builds/2052/steps/4/logs/warnings__7_

A new failure has been detected on builder binutils-fedora-ppc64le while building binutils-gdb.

Full details are available at:
    https://builder.sourceware.org/buildbot/#builders/86/builds/1954

Build state: failed compile (failure)
Revision: 1a3b4f90bc5fa5e71df1db8e663f76e262f3134d
Worker: fedora-ppc64le
Build Reason: (unknown)
Blamelist: Jan Beulich <jbeulich@suse.com>

Steps:

- 0: worker_preparation ( success )

- 1: git checkout ( success )
    Logs:
        - stdio: https://builder.sourceware.org/buildbot/#builders/86/builds/1954/steps/1/logs/stdio

- 2: rm -rf binutils-build ( success )
    Logs:
        - stdio: https://builder.sourceware.org/buildbot/#builders/86/builds/1954/steps/2/logs/stdio

- 3: configure ( success )
    Logs:
        - stdio: https://builder.sourceware.org/buildbot/#builders/86/builds/1954/steps/3/logs/stdio
        - config.log: https://builder.sourceware.org/buildbot/#builders/86/builds/1954/steps/3/logs/config_log

- 4: make ( failure )
    Logs:
        - stdio: https://builder.sourceware.org/buildbot/#builders/86/builds/1954/steps/4/logs/stdio
        - warnings (6): https://builder.sourceware.org/buildbot/#builders/86/builds/1954/steps/4/logs/warnings__6_

A new failure has been detected on builder binutils-opensuseleap-x86_64 while building binutils-gdb.

Full details are available at:
    https://builder.sourceware.org/buildbot/#builders/93/builds/1957

Build state: failed compile (failure)
Revision: 1a3b4f90bc5fa5e71df1db8e663f76e262f3134d
Worker: bb1-1
Build Reason: (unknown)
Blamelist: Jan Beulich <jbeulich@suse.com>

Steps:

- 0: worker_preparation ( success )

- 1: git checkout ( success )
    Logs:
        - stdio: https://builder.sourceware.org/buildbot/#builders/93/builds/1957/steps/1/logs/stdio

- 2: rm -rf binutils-build ( success )
    Logs:
        - stdio: https://builder.sourceware.org/buildbot/#builders/93/builds/1957/steps/2/logs/stdio

- 3: configure ( success )
    Logs:
        - stdio: https://builder.sourceware.org/buildbot/#builders/93/builds/1957/steps/3/logs/stdio
        - config.log: https://builder.sourceware.org/buildbot/#builders/93/builds/1957/steps/3/logs/config_log

- 4: make ( failure )
    Logs:
        - stdio: https://builder.sourceware.org/buildbot/#builders/93/builds/1957/steps/4/logs/stdio
        - warnings (14): https://builder.sourceware.org/buildbot/#builders/93/builds/1957/steps/4/logs/warnings__14_

A new failure has been detected on builder binutils-opensusetw-x86_64 while building binutils-gdb.

Full details are available at:
    https://builder.sourceware.org/buildbot/#builders/102/builds/1956

Build state: failed compile (failure)
Revision: 1a3b4f90bc5fa5e71df1db8e663f76e262f3134d
Worker: bb2-1
Build Reason: (unknown)
Blamelist: Jan Beulich <jbeulich@suse.com>

Steps:

- 0: worker_preparation ( success )

- 1: git checkout ( success )
    Logs:
        - stdio: https://builder.sourceware.org/buildbot/#builders/102/builds/1956/steps/1/logs/stdio

- 2: rm -rf binutils-build ( success )
    Logs:
        - stdio: https://builder.sourceware.org/buildbot/#builders/102/builds/1956/steps/2/logs/stdio

- 3: configure ( success )
    Logs:
        - stdio: https://builder.sourceware.org/buildbot/#builders/102/builds/1956/steps/3/logs/stdio
        - config.log: https://builder.sourceware.org/buildbot/#builders/102/builds/1956/steps/3/logs/config_log

- 4: make ( failure )
    Logs:
        - stdio: https://builder.sourceware.org/buildbot/#builders/102/builds/1956/steps/4/logs/stdio
        - warnings (7): https://builder.sourceware.org/buildbot/#builders/102/builds/1956/steps/4/logs/warnings__7_

A new failure has been detected on builder binutils-rawhide-x86_64 while building binutils-gdb.

Full details are available at:
    https://builder.sourceware.org/buildbot/#builders/133/builds/1810

Build state: failed compile (failure)
Revision: 1a3b4f90bc5fa5e71df1db8e663f76e262f3134d
Worker: bbo1-1
Build Reason: (unknown)
Blamelist: Jan Beulich <jbeulich@suse.com>

Steps:

- 0: worker_preparation ( success )

- 1: git checkout ( success )
    Logs:
        - stdio: https://builder.sourceware.org/buildbot/#builders/133/builds/1810/steps/1/logs/stdio

- 2: rm -rf binutils-build ( success )
    Logs:
        - stdio: https://builder.sourceware.org/buildbot/#builders/133/builds/1810/steps/2/logs/stdio

- 3: configure ( success )
    Logs:
        - stdio: https://builder.sourceware.org/buildbot/#builders/133/builds/1810/steps/3/logs/stdio
        - config.log: https://builder.sourceware.org/buildbot/#builders/133/builds/1810/steps/3/logs/config_log

- 4: make ( failure )
    Logs:
        - stdio: https://builder.sourceware.org/buildbot/#builders/133/builds/1810/steps/4/logs/stdio
        - warnings (8): https://builder.sourceware.org/buildbot/#builders/133/builds/1810/steps/4/logs/warnings__8_

A new failure has been detected on builder binutils-debian-testing-x86_64 while building binutils-gdb.

Full details are available at:
    https://builder.sourceware.org/buildbot/#builders/149/builds/1800

Build state: failed compile (failure)
Revision: 1a3b4f90bc5fa5e71df1db8e663f76e262f3134d
Worker: bb2-1
Build Reason: (unknown)
Blamelist: Jan Beulich <jbeulich@suse.com>

Steps:

- 0: worker_preparation ( success )

- 1: git checkout ( success )
    Logs:
        - stdio: https://builder.sourceware.org/buildbot/#builders/149/builds/1800/steps/1/logs/stdio

- 2: rm -rf binutils-build ( success )
    Logs:
        - stdio: https://builder.sourceware.org/buildbot/#builders/149/builds/1800/steps/2/logs/stdio

- 3: configure ( success )
    Logs:
        - stdio: https://builder.sourceware.org/buildbot/#builders/149/builds/1800/steps/3/logs/stdio
        - config.log: https://builder.sourceware.org/buildbot/#builders/149/builds/1800/steps/3/logs/config_log

- 4: make ( failure )
    Logs:
        - stdio: https://builder.sourceware.org/buildbot/#builders/149/builds/1800/steps/4/logs/stdio
        - warnings (6): https://builder.sourceware.org/buildbot/#builders/149/builds/1800/steps/4/logs/warnings__6_

A new failure has been detected on builder binutils-ubuntu22_04-arm64 while building binutils-gdb.

Full details are available at:
    https://builder.sourceware.org/buildbot/#builders/221/builds/821

Build state: failed compile (failure)
Revision: 1a3b4f90bc5fa5e71df1db8e663f76e262f3134d
Worker: arm64-ubuntu22_04
Build Reason: (unknown)
Blamelist: Jan Beulich <jbeulich@suse.com>

Steps:

- 0: worker_preparation ( success )

- 1: git checkout ( success )
    Logs:
        - stdio: https://builder.sourceware.org/buildbot/#builders/221/builds/821/steps/1/logs/stdio

- 2: rm -rf binutils-build ( success )
    Logs:
        - stdio: https://builder.sourceware.org/buildbot/#builders/221/builds/821/steps/2/logs/stdio

- 3: configure ( success )
    Logs:
        - stdio: https://builder.sourceware.org/buildbot/#builders/221/builds/821/steps/3/logs/stdio
        - config.log: https://builder.sourceware.org/buildbot/#builders/221/builds/821/steps/3/logs/config_log

- 4: make ( failure )
    Logs:
        - stdio: https://builder.sourceware.org/buildbot/#builders/221/builds/821/steps/4/logs/stdio
        - warnings (7): https://builder.sourceware.org/buildbot/#builders/221/builds/821/steps/4/logs/warnings__7_

A new failure has been detected on builder binutils-ubuntu20_04-arm64 while building binutils-gdb.

Full details are available at:
    https://builder.sourceware.org/buildbot/#builders/222/builds/821

Build state: failed compile (failure)
Revision: 1a3b4f90bc5fa5e71df1db8e663f76e262f3134d
Worker: arm64-ubuntu20_04
Build Reason: (unknown)
Blamelist: Jan Beulich <jbeulich@suse.com>

Steps:

- 0: worker_preparation ( success )

- 1: git checkout ( success )
    Logs:
        - stdio: https://builder.sourceware.org/buildbot/#builders/222/builds/821/steps/1/logs/stdio

- 2: rm -rf binutils-build ( success )
    Logs:
        - stdio: https://builder.sourceware.org/buildbot/#builders/222/builds/821/steps/2/logs/stdio

- 3: configure ( success )
    Logs:
        - stdio: https://builder.sourceware.org/buildbot/#builders/222/builds/821/steps/3/logs/stdio
        - config.log: https://builder.sourceware.org/buildbot/#builders/222/builds/821/steps/3/logs/config_log

- 4: make ( failure )
    Logs:
        - stdio: https://builder.sourceware.org/buildbot/#builders/222/builds/821/steps/4/logs/stdio
        - warnings (15): https://builder.sourceware.org/buildbot/#builders/222/builds/821/steps/4/logs/warnings__15_

A new failure has been detected on builder binutils-gentoo-sparc while building binutils-gdb.

Full details are available at:
    https://builder.sourceware.org/buildbot/#builders/228/builds/755

Build state: failed compile (failure)
Revision: 1a3b4f90bc5fa5e71df1db8e663f76e262f3134d
Worker: gentoo-sparc
Build Reason: (unknown)
Blamelist: Jan Beulich <jbeulich@suse.com>

Steps:

- 0: worker_preparation ( success )

- 1: git checkout ( success )
    Logs:
        - stdio: https://builder.sourceware.org/buildbot/#builders/228/builds/755/steps/1/logs/stdio

- 2: rm -rf binutils-build ( success )
    Logs:
        - stdio: https://builder.sourceware.org/buildbot/#builders/228/builds/755/steps/2/logs/stdio

- 3: configure ( success )
    Logs:
        - stdio: https://builder.sourceware.org/buildbot/#builders/228/builds/755/steps/3/logs/stdio
        - config.log: https://builder.sourceware.org/buildbot/#builders/228/builds/755/steps/3/logs/config_log

- 4: make ( failure )
    Logs:
        - stdio: https://builder.sourceware.org/buildbot/#builders/228/builds/755/steps/4/logs/stdio
        - warnings (7): https://builder.sourceware.org/buildbot/#builders/228/builds/755/steps/4/logs/warnings__7_


^ permalink raw reply	[flat|nested] 29+ messages in thread

* ☠ Buildbot (Sourceware): binutils-gdb - failed compile (failure) (master)
@ 2023-05-26  7:16 builder
  0 siblings, 0 replies; 29+ messages in thread
From: builder @ 2023-05-26  7:16 UTC (permalink / raw)
  To: binutils

A new failure has been detected on builder binutils-debian-amd64 while building binutils-gdb.

Full details are available at:
    https://builder.sourceware.org/buildbot/#builders/68/builds/2085

Build state: failed compile (failure)
Revision: 812d868850126d8e791795c7e248ffbf580925f6
Worker: bb2-2
Build Reason: (unknown)
Blamelist: Indu Bhagat <indu.bhagat@oracle.com>

Steps:

- 0: worker_preparation ( success )

- 1: git checkout ( success )
    Logs:
        - stdio: https://builder.sourceware.org/buildbot/#builders/68/builds/2085/steps/1/logs/stdio

- 2: rm -rf binutils-build ( success )
    Logs:
        - stdio: https://builder.sourceware.org/buildbot/#builders/68/builds/2085/steps/2/logs/stdio

- 3: configure ( success )
    Logs:
        - stdio: https://builder.sourceware.org/buildbot/#builders/68/builds/2085/steps/3/logs/stdio
        - config.log: https://builder.sourceware.org/buildbot/#builders/68/builds/2085/steps/3/logs/config_log

- 4: make ( failure )
    Logs:
        - stdio: https://builder.sourceware.org/buildbot/#builders/68/builds/2085/steps/4/logs/stdio
        - warnings (4): https://builder.sourceware.org/buildbot/#builders/68/builds/2085/steps/4/logs/warnings__4_

A new failure has been detected on builder binutils-fedora-x86_64 while building binutils-gdb.

Full details are available at:
    https://builder.sourceware.org/buildbot/#builders/77/builds/2069

Build state: failed compile (failure)
Revision: 812d868850126d8e791795c7e248ffbf580925f6
Worker: bb1-2
Build Reason: (unknown)
Blamelist: Indu Bhagat <indu.bhagat@oracle.com>

Steps:

- 0: worker_preparation ( success )

- 1: git checkout ( success )
    Logs:
        - stdio: https://builder.sourceware.org/buildbot/#builders/77/builds/2069/steps/1/logs/stdio

- 2: rm -rf binutils-build ( success )
    Logs:
        - stdio: https://builder.sourceware.org/buildbot/#builders/77/builds/2069/steps/2/logs/stdio

- 3: configure ( success )
    Logs:
        - stdio: https://builder.sourceware.org/buildbot/#builders/77/builds/2069/steps/3/logs/stdio
        - config.log: https://builder.sourceware.org/buildbot/#builders/77/builds/2069/steps/3/logs/config_log

- 4: make ( failure )
    Logs:
        - stdio: https://builder.sourceware.org/buildbot/#builders/77/builds/2069/steps/4/logs/stdio
        - warnings (1): https://builder.sourceware.org/buildbot/#builders/77/builds/2069/steps/4/logs/warnings__1_

A new failure has been detected on builder binutils-debian-ppc64 while building binutils-gdb.

Full details are available at:
    https://builder.sourceware.org/buildbot/#builders/78/builds/2045

Build state: failed compile (failure)
Revision: 812d868850126d8e791795c7e248ffbf580925f6
Worker: debian-ppc64
Build Reason: (unknown)
Blamelist: Indu Bhagat <indu.bhagat@oracle.com>

Steps:

- 0: worker_preparation ( success )

- 1: git checkout ( success )
    Logs:
        - stdio: https://builder.sourceware.org/buildbot/#builders/78/builds/2045/steps/1/logs/stdio

- 2: rm -rf binutils-build ( success )
    Logs:
        - stdio: https://builder.sourceware.org/buildbot/#builders/78/builds/2045/steps/2/logs/stdio

- 3: configure ( success )
    Logs:
        - stdio: https://builder.sourceware.org/buildbot/#builders/78/builds/2045/steps/3/logs/stdio
        - config.log: https://builder.sourceware.org/buildbot/#builders/78/builds/2045/steps/3/logs/config_log

- 4: make ( failure )
    Logs:
        - stdio: https://builder.sourceware.org/buildbot/#builders/78/builds/2045/steps/4/logs/stdio

A new failure has been detected on builder binutils-fedora-ppc64le while building binutils-gdb.

Full details are available at:
    https://builder.sourceware.org/buildbot/#builders/86/builds/1947

Build state: failed compile (failure)
Revision: 812d868850126d8e791795c7e248ffbf580925f6
Worker: fedora-ppc64le
Build Reason: (unknown)
Blamelist: Indu Bhagat <indu.bhagat@oracle.com>

Steps:

- 0: worker_preparation ( success )

- 1: git checkout ( success )
    Logs:
        - stdio: https://builder.sourceware.org/buildbot/#builders/86/builds/1947/steps/1/logs/stdio

- 2: rm -rf binutils-build ( success )
    Logs:
        - stdio: https://builder.sourceware.org/buildbot/#builders/86/builds/1947/steps/2/logs/stdio

- 3: configure ( success )
    Logs:
        - stdio: https://builder.sourceware.org/buildbot/#builders/86/builds/1947/steps/3/logs/stdio
        - config.log: https://builder.sourceware.org/buildbot/#builders/86/builds/1947/steps/3/logs/config_log

- 4: make ( failure )
    Logs:
        - stdio: https://builder.sourceware.org/buildbot/#builders/86/builds/1947/steps/4/logs/stdio

A new failure has been detected on builder binutils-opensuseleap-x86_64 while building binutils-gdb.

Full details are available at:
    https://builder.sourceware.org/buildbot/#builders/93/builds/1950

Build state: failed compile (failure)
Revision: 812d868850126d8e791795c7e248ffbf580925f6
Worker: bb2-1
Build Reason: (unknown)
Blamelist: Indu Bhagat <indu.bhagat@oracle.com>

Steps:

- 0: worker_preparation ( success )

- 1: git checkout ( success )
    Logs:
        - stdio: https://builder.sourceware.org/buildbot/#builders/93/builds/1950/steps/1/logs/stdio

- 2: rm -rf binutils-build ( success )
    Logs:
        - stdio: https://builder.sourceware.org/buildbot/#builders/93/builds/1950/steps/2/logs/stdio

- 3: configure ( success )
    Logs:
        - stdio: https://builder.sourceware.org/buildbot/#builders/93/builds/1950/steps/3/logs/stdio
        - config.log: https://builder.sourceware.org/buildbot/#builders/93/builds/1950/steps/3/logs/config_log

- 4: make ( failure )
    Logs:
        - stdio: https://builder.sourceware.org/buildbot/#builders/93/builds/1950/steps/4/logs/stdio

A new failure has been detected on builder binutils-opensusetw-x86_64 while building binutils-gdb.

Full details are available at:
    https://builder.sourceware.org/buildbot/#builders/102/builds/1949

Build state: failed compile (failure)
Revision: 812d868850126d8e791795c7e248ffbf580925f6
Worker: bb2-2
Build Reason: (unknown)
Blamelist: Indu Bhagat <indu.bhagat@oracle.com>

Steps:

- 0: worker_preparation ( success )

- 1: git checkout ( success )
    Logs:
        - stdio: https://builder.sourceware.org/buildbot/#builders/102/builds/1949/steps/1/logs/stdio

- 2: rm -rf binutils-build ( success )
    Logs:
        - stdio: https://builder.sourceware.org/buildbot/#builders/102/builds/1949/steps/2/logs/stdio

- 3: configure ( success )
    Logs:
        - stdio: https://builder.sourceware.org/buildbot/#builders/102/builds/1949/steps/3/logs/stdio
        - config.log: https://builder.sourceware.org/buildbot/#builders/102/builds/1949/steps/3/logs/config_log

- 4: make ( failure )
    Logs:
        - stdio: https://builder.sourceware.org/buildbot/#builders/102/builds/1949/steps/4/logs/stdio

A new failure has been detected on builder binutils-rawhide-x86_64 while building binutils-gdb.

Full details are available at:
    https://builder.sourceware.org/buildbot/#builders/133/builds/1803

Build state: failed compile (failure)
Revision: 812d868850126d8e791795c7e248ffbf580925f6
Worker: bb3
Build Reason: (unknown)
Blamelist: Indu Bhagat <indu.bhagat@oracle.com>

Steps:

- 0: worker_preparation ( success )

- 1: git checkout ( success )
    Logs:
        - stdio: https://builder.sourceware.org/buildbot/#builders/133/builds/1803/steps/1/logs/stdio

- 2: rm -rf binutils-build ( success )
    Logs:
        - stdio: https://builder.sourceware.org/buildbot/#builders/133/builds/1803/steps/2/logs/stdio

- 3: configure ( success )
    Logs:
        - stdio: https://builder.sourceware.org/buildbot/#builders/133/builds/1803/steps/3/logs/stdio
        - config.log: https://builder.sourceware.org/buildbot/#builders/133/builds/1803/steps/3/logs/config_log

- 4: make ( failure )
    Logs:
        - stdio: https://builder.sourceware.org/buildbot/#builders/133/builds/1803/steps/4/logs/stdio
        - warnings (6): https://builder.sourceware.org/buildbot/#builders/133/builds/1803/steps/4/logs/warnings__6_

A new failure has been detected on builder binutils-debian-testing-x86_64 while building binutils-gdb.

Full details are available at:
    https://builder.sourceware.org/buildbot/#builders/149/builds/1793

Build state: failed compile (failure)
Revision: 812d868850126d8e791795c7e248ffbf580925f6
Worker: bb3
Build Reason: (unknown)
Blamelist: Indu Bhagat <indu.bhagat@oracle.com>

Steps:

- 0: worker_preparation ( success )

- 1: git checkout ( success )
    Logs:
        - stdio: https://builder.sourceware.org/buildbot/#builders/149/builds/1793/steps/1/logs/stdio

- 2: rm -rf binutils-build ( success )
    Logs:
        - stdio: https://builder.sourceware.org/buildbot/#builders/149/builds/1793/steps/2/logs/stdio

- 3: configure ( success )
    Logs:
        - stdio: https://builder.sourceware.org/buildbot/#builders/149/builds/1793/steps/3/logs/stdio
        - config.log: https://builder.sourceware.org/buildbot/#builders/149/builds/1793/steps/3/logs/config_log

- 4: make ( failure )
    Logs:
        - stdio: https://builder.sourceware.org/buildbot/#builders/149/builds/1793/steps/4/logs/stdio

A new failure has been detected on builder binutils-ubuntu22_04-arm64 while building binutils-gdb.

Full details are available at:
    https://builder.sourceware.org/buildbot/#builders/221/builds/814

Build state: failed compile (failure)
Revision: 812d868850126d8e791795c7e248ffbf580925f6
Worker: arm64-ubuntu22_04
Build Reason: (unknown)
Blamelist: Indu Bhagat <indu.bhagat@oracle.com>

Steps:

- 0: worker_preparation ( success )

- 1: git checkout ( success )
    Logs:
        - stdio: https://builder.sourceware.org/buildbot/#builders/221/builds/814/steps/1/logs/stdio

- 2: rm -rf binutils-build ( success )
    Logs:
        - stdio: https://builder.sourceware.org/buildbot/#builders/221/builds/814/steps/2/logs/stdio

- 3: configure ( success )
    Logs:
        - stdio: https://builder.sourceware.org/buildbot/#builders/221/builds/814/steps/3/logs/stdio
        - config.log: https://builder.sourceware.org/buildbot/#builders/221/builds/814/steps/3/logs/config_log

- 4: make ( failure )
    Logs:
        - stdio: https://builder.sourceware.org/buildbot/#builders/221/builds/814/steps/4/logs/stdio

A new failure has been detected on builder binutils-ubuntu20_04-arm64 while building binutils-gdb.

Full details are available at:
    https://builder.sourceware.org/buildbot/#builders/222/builds/814

Build state: failed compile (failure)
Revision: 812d868850126d8e791795c7e248ffbf580925f6
Worker: arm64-ubuntu20_04
Build Reason: (unknown)
Blamelist: Indu Bhagat <indu.bhagat@oracle.com>

Steps:

- 0: worker_preparation ( success )

- 1: git checkout ( success )
    Logs:
        - stdio: https://builder.sourceware.org/buildbot/#builders/222/builds/814/steps/1/logs/stdio

- 2: rm -rf binutils-build ( success )
    Logs:
        - stdio: https://builder.sourceware.org/buildbot/#builders/222/builds/814/steps/2/logs/stdio

- 3: configure ( success )
    Logs:
        - stdio: https://builder.sourceware.org/buildbot/#builders/222/builds/814/steps/3/logs/stdio
        - config.log: https://builder.sourceware.org/buildbot/#builders/222/builds/814/steps/3/logs/config_log

- 4: make ( failure )
    Logs:
        - stdio: https://builder.sourceware.org/buildbot/#builders/222/builds/814/steps/4/logs/stdio

A new failure has been detected on builder binutils-gentoo-sparc while building binutils-gdb.

Full details are available at:
    https://builder.sourceware.org/buildbot/#builders/228/builds/748

Build state: failed compile (failure)
Revision: 812d868850126d8e791795c7e248ffbf580925f6
Worker: gentoo-sparc
Build Reason: (unknown)
Blamelist: Indu Bhagat <indu.bhagat@oracle.com>

Steps:

- 0: worker_preparation ( success )

- 1: git checkout ( success )
    Logs:
        - stdio: https://builder.sourceware.org/buildbot/#builders/228/builds/748/steps/1/logs/stdio

- 2: rm -rf binutils-build ( success )
    Logs:
        - stdio: https://builder.sourceware.org/buildbot/#builders/228/builds/748/steps/2/logs/stdio

- 3: configure ( success )
    Logs:
        - stdio: https://builder.sourceware.org/buildbot/#builders/228/builds/748/steps/3/logs/stdio
        - config.log: https://builder.sourceware.org/buildbot/#builders/228/builds/748/steps/3/logs/config_log

- 4: make ( failure )
    Logs:
        - stdio: https://builder.sourceware.org/buildbot/#builders/228/builds/748/steps/4/logs/stdio
        - warnings (5): https://builder.sourceware.org/buildbot/#builders/228/builds/748/steps/4/logs/warnings__5_


^ permalink raw reply	[flat|nested] 29+ messages in thread

* ☠ Buildbot (Sourceware): binutils-gdb - failed compile (failure) (master)
@ 2023-05-23  6:10 builder
  0 siblings, 0 replies; 29+ messages in thread
From: builder @ 2023-05-23  6:10 UTC (permalink / raw)
  To: binutils

A new failure has been detected on builder binutils-debian-amd64 while building binutils-gdb.

Full details are available at:
    https://builder.sourceware.org/buildbot/#builders/68/builds/2070

Build state: failed compile (failure)
Revision: e5a497fe38e0ab19e16bdd9e4b4ed5e4d0056478
Worker: bb2-2
Build Reason: (unknown)
Blamelist: Zhang, Jun <jun.zhang@intel.com>

Steps:

- 0: worker_preparation ( success )

- 1: git checkout ( success )
    Logs:
        - stdio: https://builder.sourceware.org/buildbot/#builders/68/builds/2070/steps/1/logs/stdio

- 2: rm -rf binutils-build ( success )
    Logs:
        - stdio: https://builder.sourceware.org/buildbot/#builders/68/builds/2070/steps/2/logs/stdio

- 3: configure ( success )
    Logs:
        - stdio: https://builder.sourceware.org/buildbot/#builders/68/builds/2070/steps/3/logs/stdio
        - config.log: https://builder.sourceware.org/buildbot/#builders/68/builds/2070/steps/3/logs/config_log

- 4: make ( failure )
    Logs:
        - stdio: https://builder.sourceware.org/buildbot/#builders/68/builds/2070/steps/4/logs/stdio
        - warnings (14): https://builder.sourceware.org/buildbot/#builders/68/builds/2070/steps/4/logs/warnings__14_

A new failure has been detected on builder binutils-fedora-x86_64 while building binutils-gdb.

Full details are available at:
    https://builder.sourceware.org/buildbot/#builders/77/builds/2054

Build state: failed compile (failure)
Revision: e5a497fe38e0ab19e16bdd9e4b4ed5e4d0056478
Worker: bb1-2
Build Reason: (unknown)
Blamelist: Zhang, Jun <jun.zhang@intel.com>

Steps:

- 0: worker_preparation ( success )

- 1: git checkout ( success )
    Logs:
        - stdio: https://builder.sourceware.org/buildbot/#builders/77/builds/2054/steps/1/logs/stdio

- 2: rm -rf binutils-build ( success )
    Logs:
        - stdio: https://builder.sourceware.org/buildbot/#builders/77/builds/2054/steps/2/logs/stdio

- 3: configure ( success )
    Logs:
        - stdio: https://builder.sourceware.org/buildbot/#builders/77/builds/2054/steps/3/logs/stdio
        - config.log: https://builder.sourceware.org/buildbot/#builders/77/builds/2054/steps/3/logs/config_log

- 4: make ( failure )
    Logs:
        - stdio: https://builder.sourceware.org/buildbot/#builders/77/builds/2054/steps/4/logs/stdio
        - warnings (8): https://builder.sourceware.org/buildbot/#builders/77/builds/2054/steps/4/logs/warnings__8_

A new failure has been detected on builder binutils-opensuseleap-x86_64 while building binutils-gdb.

Full details are available at:
    https://builder.sourceware.org/buildbot/#builders/93/builds/1935

Build state: failed compile (failure)
Revision: e5a497fe38e0ab19e16bdd9e4b4ed5e4d0056478
Worker: bbo1-1
Build Reason: (unknown)
Blamelist: Zhang, Jun <jun.zhang@intel.com>

Steps:

- 0: worker_preparation ( success )

- 1: git checkout ( success )
    Logs:
        - stdio: https://builder.sourceware.org/buildbot/#builders/93/builds/1935/steps/1/logs/stdio

- 2: rm -rf binutils-build ( success )
    Logs:
        - stdio: https://builder.sourceware.org/buildbot/#builders/93/builds/1935/steps/2/logs/stdio

- 3: configure ( success )
    Logs:
        - stdio: https://builder.sourceware.org/buildbot/#builders/93/builds/1935/steps/3/logs/stdio
        - config.log: https://builder.sourceware.org/buildbot/#builders/93/builds/1935/steps/3/logs/config_log

- 4: make ( failure )
    Logs:
        - stdio: https://builder.sourceware.org/buildbot/#builders/93/builds/1935/steps/4/logs/stdio
        - warnings (14): https://builder.sourceware.org/buildbot/#builders/93/builds/1935/steps/4/logs/warnings__14_

A new failure has been detected on builder binutils-opensusetw-x86_64 while building binutils-gdb.

Full details are available at:
    https://builder.sourceware.org/buildbot/#builders/102/builds/1934

Build state: failed compile (failure)
Revision: e5a497fe38e0ab19e16bdd9e4b4ed5e4d0056478
Worker: bb1-1
Build Reason: (unknown)
Blamelist: Zhang, Jun <jun.zhang@intel.com>

Steps:

- 0: worker_preparation ( success )

- 1: git checkout ( success )
    Logs:
        - stdio: https://builder.sourceware.org/buildbot/#builders/102/builds/1934/steps/1/logs/stdio

- 2: rm -rf binutils-build ( success )
    Logs:
        - stdio: https://builder.sourceware.org/buildbot/#builders/102/builds/1934/steps/2/logs/stdio

- 3: configure ( success )
    Logs:
        - stdio: https://builder.sourceware.org/buildbot/#builders/102/builds/1934/steps/3/logs/stdio
        - config.log: https://builder.sourceware.org/buildbot/#builders/102/builds/1934/steps/3/logs/config_log

- 4: make ( failure )
    Logs:
        - stdio: https://builder.sourceware.org/buildbot/#builders/102/builds/1934/steps/4/logs/stdio
        - warnings (7): https://builder.sourceware.org/buildbot/#builders/102/builds/1934/steps/4/logs/warnings__7_

A new failure has been detected on builder binutils-rawhide-x86_64 while building binutils-gdb.

Full details are available at:
    https://builder.sourceware.org/buildbot/#builders/133/builds/1788

Build state: failed compile (failure)
Revision: e5a497fe38e0ab19e16bdd9e4b4ed5e4d0056478
Worker: bb2-2
Build Reason: (unknown)
Blamelist: Zhang, Jun <jun.zhang@intel.com>

Steps:

- 0: worker_preparation ( success )

- 1: git checkout ( success )
    Logs:
        - stdio: https://builder.sourceware.org/buildbot/#builders/133/builds/1788/steps/1/logs/stdio

- 2: rm -rf binutils-build ( success )
    Logs:
        - stdio: https://builder.sourceware.org/buildbot/#builders/133/builds/1788/steps/2/logs/stdio

- 3: configure ( success )
    Logs:
        - stdio: https://builder.sourceware.org/buildbot/#builders/133/builds/1788/steps/3/logs/stdio
        - config.log: https://builder.sourceware.org/buildbot/#builders/133/builds/1788/steps/3/logs/config_log

- 4: make ( failure )
    Logs:
        - stdio: https://builder.sourceware.org/buildbot/#builders/133/builds/1788/steps/4/logs/stdio
        - warnings (8): https://builder.sourceware.org/buildbot/#builders/133/builds/1788/steps/4/logs/warnings__8_

A new failure has been detected on builder binutils-debian-testing-x86_64 while building binutils-gdb.

Full details are available at:
    https://builder.sourceware.org/buildbot/#builders/149/builds/1778

Build state: failed compile (failure)
Revision: e5a497fe38e0ab19e16bdd9e4b4ed5e4d0056478
Worker: bb1-1
Build Reason: (unknown)
Blamelist: Zhang, Jun <jun.zhang@intel.com>

Steps:

- 0: worker_preparation ( success )

- 1: git checkout ( success )
    Logs:
        - stdio: https://builder.sourceware.org/buildbot/#builders/149/builds/1778/steps/1/logs/stdio

- 2: rm -rf binutils-build ( success )
    Logs:
        - stdio: https://builder.sourceware.org/buildbot/#builders/149/builds/1778/steps/2/logs/stdio

- 3: configure ( success )
    Logs:
        - stdio: https://builder.sourceware.org/buildbot/#builders/149/builds/1778/steps/3/logs/stdio
        - config.log: https://builder.sourceware.org/buildbot/#builders/149/builds/1778/steps/3/logs/config_log

- 4: make ( failure )
    Logs:
        - stdio: https://builder.sourceware.org/buildbot/#builders/149/builds/1778/steps/4/logs/stdio
        - warnings (6): https://builder.sourceware.org/buildbot/#builders/149/builds/1778/steps/4/logs/warnings__6_


^ permalink raw reply	[flat|nested] 29+ messages in thread

* Re: ☠ Buildbot (Sourceware): binutils-gdb - failed compile (failure) (master)
  2023-04-24 10:33   ` Alan Modra
  2023-04-24 10:39     ` Jan Beulich
@ 2023-04-24 11:48     ` Mark Wielaard
  1 sibling, 0 replies; 29+ messages in thread
From: Mark Wielaard @ 2023-04-24 11:48 UTC (permalink / raw)
  To: Alan Modra, Jan Beulich; +Cc: binutils, H.J. Lu

Hi,

On Mon, 2023-04-24 at 20:03 +0930, Alan Modra via Binutils wrote:
> On Mon, Apr 24, 2023 at 08:04:35AM +0200, Jan Beulich via Binutils wrote:
> > On 24.04.2023 02:31, builder--- via Binutils wrote:
> > > - 4: make ( failure )
> > >     Logs:
> > >         - stdio: https://builder.sourceware.org/buildbot/#builders/77/builds/1931/steps/4/logs/stdio
> > >         - warnings (8): https://builder.sourceware.org/buildbot/#builders/77/builds/1931/steps/4/logs/warnings__8_
> > 
> > ../../binutils-gdb/opcodes/i386-dis.c: In function ‘print_insn’:
> > ../../binutils-gdb/opcodes/i386-dis.c:9865:22: error: storing the address of local variable ‘priv’ in ‘*info.private_data’ [-Werror=dangling-pointer=]
> >  9865 |   info->private_data = &priv;
> >       |   ~~~~~~~~~~~~~~~~~~~^~~~~~~
> > ../../binutils-gdb/opcodes/i386-dis.c:9739:22: note: ‘priv’ declared here
> >  9739 |   struct dis_private priv;
> >       |                      ^~~~
> > ../../binutils-gdb/opcodes/i386-dis.c:9739:22: note: ‘info’ declared here
> > cc1: all warnings being treated as errors
> > make[3]: *** [Makefile:1071: i386-dis.lo] Error 1
> > 
> > Which, given that this hasn't changed in a while, makes me think that a
> > new compiler was recently installed, which now diagnoses this supposed
> 
> gcc-13, I expect.

It is. Even though not yet officially released (any day now). gcc
13.0.1 has already been included in the latest fedora release.

This builder is using a container based on fedora-latest, which was
using gcc 12 before (fedora 37) but switched to fedora 38 now that is
officially released (which uses gcc 13).

Cheers,

Mark

^ permalink raw reply	[flat|nested] 29+ messages in thread

* Re: ☠ Buildbot (Sourceware): binutils-gdb - failed compile (failure) (master)
  2023-04-24 10:33   ` Alan Modra
@ 2023-04-24 10:39     ` Jan Beulich
  2023-04-24 11:48     ` Mark Wielaard
  1 sibling, 0 replies; 29+ messages in thread
From: Jan Beulich @ 2023-04-24 10:39 UTC (permalink / raw)
  To: Alan Modra; +Cc: binutils, H.J. Lu

On 24.04.2023 12:33, Alan Modra wrote:
> On Mon, Apr 24, 2023 at 08:04:35AM +0200, Jan Beulich via Binutils wrote:
>> On 24.04.2023 02:31, builder--- via Binutils wrote:
>>> - 4: make ( failure )
>>>     Logs:
>>>         - stdio: https://builder.sourceware.org/buildbot/#builders/77/builds/1931/steps/4/logs/stdio
>>>         - warnings (8): https://builder.sourceware.org/buildbot/#builders/77/builds/1931/steps/4/logs/warnings__8_
>>
>> ../../binutils-gdb/opcodes/i386-dis.c: In function ‘print_insn’:
>> ../../binutils-gdb/opcodes/i386-dis.c:9865:22: error: storing the address of local variable ‘priv’ in ‘*info.private_data’ [-Werror=dangling-pointer=]
>>  9865 |   info->private_data = &priv;
>>       |   ~~~~~~~~~~~~~~~~~~~^~~~~~~
>> ../../binutils-gdb/opcodes/i386-dis.c:9739:22: note: ‘priv’ declared here
>>  9739 |   struct dis_private priv;
>>       |                      ^~~~
>> ../../binutils-gdb/opcodes/i386-dis.c:9739:22: note: ‘info’ declared here
>> cc1: all warnings being treated as errors
>> make[3]: *** [Makefile:1071: i386-dis.lo] Error 1
>>
>> Which, given that this hasn't changed in a while, makes me think that a
>> new compiler was recently installed, which now diagnoses this supposed
> 
> gcc-13, I expect.

After having experimented a little with godbolt.org's help (before making
the patch that you're now about to revert), I found that gcc12 is giving
this warning, too (at least in simple cases). So it may really have been
the removal of the unconditional OPCODES_SIGSETJMP() which has triggered
the warning to appear - in my playing, any unconditional function call
between the setting of the field and returning ended up masking the
warning.

Jan

>> issue (and, btw, mis-diagnoses where "info" is declared). We can't do
>> away with the assignment; it's unclear to me whether overwriting the
>> field with NULL before returning would make a difference.
> 
> It does.  See my other email.
> 
>> Dynamically
>> allocating "priv" would be a theoretical option, but I don't view this as
>> a good one in practice.
>>
>> Thoughts, anyone?
>>
>> Jan
> 


^ permalink raw reply	[flat|nested] 29+ messages in thread

* Re: ☠ Buildbot (Sourceware): binutils-gdb - failed compile (failure) (master)
  2023-04-24  6:04 ` Jan Beulich
@ 2023-04-24 10:33   ` Alan Modra
  2023-04-24 10:39     ` Jan Beulich
  2023-04-24 11:48     ` Mark Wielaard
  0 siblings, 2 replies; 29+ messages in thread
From: Alan Modra @ 2023-04-24 10:33 UTC (permalink / raw)
  To: Jan Beulich; +Cc: binutils, H.J. Lu

On Mon, Apr 24, 2023 at 08:04:35AM +0200, Jan Beulich via Binutils wrote:
> On 24.04.2023 02:31, builder--- via Binutils wrote:
> > - 4: make ( failure )
> >     Logs:
> >         - stdio: https://builder.sourceware.org/buildbot/#builders/77/builds/1931/steps/4/logs/stdio
> >         - warnings (8): https://builder.sourceware.org/buildbot/#builders/77/builds/1931/steps/4/logs/warnings__8_
> 
> ../../binutils-gdb/opcodes/i386-dis.c: In function ‘print_insn’:
> ../../binutils-gdb/opcodes/i386-dis.c:9865:22: error: storing the address of local variable ‘priv’ in ‘*info.private_data’ [-Werror=dangling-pointer=]
>  9865 |   info->private_data = &priv;
>       |   ~~~~~~~~~~~~~~~~~~~^~~~~~~
> ../../binutils-gdb/opcodes/i386-dis.c:9739:22: note: ‘priv’ declared here
>  9739 |   struct dis_private priv;
>       |                      ^~~~
> ../../binutils-gdb/opcodes/i386-dis.c:9739:22: note: ‘info’ declared here
> cc1: all warnings being treated as errors
> make[3]: *** [Makefile:1071: i386-dis.lo] Error 1
> 
> Which, given that this hasn't changed in a while, makes me think that a
> new compiler was recently installed, which now diagnoses this supposed

gcc-13, I expect.

> issue (and, btw, mis-diagnoses where "info" is declared). We can't do
> away with the assignment; it's unclear to me whether overwriting the
> field with NULL before returning would make a difference.

It does.  See my other email.

> Dynamically
> allocating "priv" would be a theoretical option, but I don't view this as
> a good one in practice.
> 
> Thoughts, anyone?
> 
> Jan

-- 
Alan Modra
Australia Development Lab, IBM

^ permalink raw reply	[flat|nested] 29+ messages in thread

* Re: ☠ Buildbot (Sourceware): binutils-gdb - failed compile (failure) (master)
  2023-04-24  0:31 builder
@ 2023-04-24  6:04 ` Jan Beulich
  2023-04-24 10:33   ` Alan Modra
  0 siblings, 1 reply; 29+ messages in thread
From: Jan Beulich @ 2023-04-24  6:04 UTC (permalink / raw)
  To: binutils; +Cc: H.J. Lu

On 24.04.2023 02:31, builder--- via Binutils wrote:
> - 4: make ( failure )
>     Logs:
>         - stdio: https://builder.sourceware.org/buildbot/#builders/77/builds/1931/steps/4/logs/stdio
>         - warnings (8): https://builder.sourceware.org/buildbot/#builders/77/builds/1931/steps/4/logs/warnings__8_

../../binutils-gdb/opcodes/i386-dis.c: In function ‘print_insn’:
../../binutils-gdb/opcodes/i386-dis.c:9865:22: error: storing the address of local variable ‘priv’ in ‘*info.private_data’ [-Werror=dangling-pointer=]
 9865 |   info->private_data = &priv;
      |   ~~~~~~~~~~~~~~~~~~~^~~~~~~
../../binutils-gdb/opcodes/i386-dis.c:9739:22: note: ‘priv’ declared here
 9739 |   struct dis_private priv;
      |                      ^~~~
../../binutils-gdb/opcodes/i386-dis.c:9739:22: note: ‘info’ declared here
cc1: all warnings being treated as errors
make[3]: *** [Makefile:1071: i386-dis.lo] Error 1

Which, given that this hasn't changed in a while, makes me think that a
new compiler was recently installed, which now diagnoses this supposed
issue (and, btw, mis-diagnoses where "info" is declared). We can't do
away with the assignment; it's unclear to me whether overwriting the
field with NULL before returning would make a difference. Dynamically
allocating "priv" would be a theoretical option, but I don't view this as
a good one in practice.

Thoughts, anyone?

Jan

^ permalink raw reply	[flat|nested] 29+ messages in thread

* ☠ Buildbot (Sourceware): binutils-gdb - failed compile (failure) (master)
@ 2023-04-24  0:31 builder
  2023-04-24  6:04 ` Jan Beulich
  0 siblings, 1 reply; 29+ messages in thread
From: builder @ 2023-04-24  0:31 UTC (permalink / raw)
  To: binutils

A new failure has been detected on builder binutils-fedora-x86_64 while building binutils-gdb.

Full details are available at:
    https://builder.sourceware.org/buildbot/#builders/77/builds/1931

Build state: failed compile (failure)
Revision: d4a174a5cbb794143164897a4e8a08972fd251a1
Worker: bb1-2
Build Reason: (unknown)
Blamelist: GDB Administrator <gdbadmin@sourceware.org>

Steps:

- 0: worker_preparation ( success )

- 1: git checkout ( success )
    Logs:
        - stdio: https://builder.sourceware.org/buildbot/#builders/77/builds/1931/steps/1/logs/stdio

- 2: rm -rf binutils-build ( success )
    Logs:
        - stdio: https://builder.sourceware.org/buildbot/#builders/77/builds/1931/steps/2/logs/stdio

- 3: configure ( success )
    Logs:
        - stdio: https://builder.sourceware.org/buildbot/#builders/77/builds/1931/steps/3/logs/stdio
        - config.log: https://builder.sourceware.org/buildbot/#builders/77/builds/1931/steps/3/logs/config_log

- 4: make ( failure )
    Logs:
        - stdio: https://builder.sourceware.org/buildbot/#builders/77/builds/1931/steps/4/logs/stdio
        - warnings (8): https://builder.sourceware.org/buildbot/#builders/77/builds/1931/steps/4/logs/warnings__8_


^ permalink raw reply	[flat|nested] 29+ messages in thread

* ☠ Buildbot (Sourceware): binutils-gdb - failed compile (failure) (master)
@ 2023-04-21 13:56 builder
  0 siblings, 0 replies; 29+ messages in thread
From: builder @ 2023-04-21 13:56 UTC (permalink / raw)
  To: binutils

A new failure has been detected on builder binutils-debian-amd64 while building binutils-gdb.

Full details are available at:
    https://builder.sourceware.org/buildbot/#builders/68/builds/1937

Build state: failed compile (failure)
Revision: a82b3c5656d62a47173ddebab52819a2d0788de7
Worker: bb1-1
Build Reason: (unknown)
Blamelist: Jan Beulich <jbeulich@suse.com>

Steps:

- 0: worker_preparation ( success )

- 1: git checkout ( success )
    Logs:
        - stdio: https://builder.sourceware.org/buildbot/#builders/68/builds/1937/steps/1/logs/stdio

- 2: rm -rf binutils-build ( success )
    Logs:
        - stdio: https://builder.sourceware.org/buildbot/#builders/68/builds/1937/steps/2/logs/stdio

- 3: configure ( success )
    Logs:
        - stdio: https://builder.sourceware.org/buildbot/#builders/68/builds/1937/steps/3/logs/stdio
        - config.log: https://builder.sourceware.org/buildbot/#builders/68/builds/1937/steps/3/logs/config_log

- 4: make ( failure )
    Logs:
        - stdio: https://builder.sourceware.org/buildbot/#builders/68/builds/1937/steps/4/logs/stdio
        - warnings (14): https://builder.sourceware.org/buildbot/#builders/68/builds/1937/steps/4/logs/warnings__14_

A new failure has been detected on builder binutils-fedora-x86_64 while building binutils-gdb.

Full details are available at:
    https://builder.sourceware.org/buildbot/#builders/77/builds/1921

Build state: failed compile (failure)
Revision: a82b3c5656d62a47173ddebab52819a2d0788de7
Worker: bb1-1
Build Reason: (unknown)
Blamelist: Jan Beulich <jbeulich@suse.com>

Steps:

- 0: worker_preparation ( success )

- 1: git checkout ( success )
    Logs:
        - stdio: https://builder.sourceware.org/buildbot/#builders/77/builds/1921/steps/1/logs/stdio

- 2: rm -rf binutils-build ( success )
    Logs:
        - stdio: https://builder.sourceware.org/buildbot/#builders/77/builds/1921/steps/2/logs/stdio

- 3: configure ( success )
    Logs:
        - stdio: https://builder.sourceware.org/buildbot/#builders/77/builds/1921/steps/3/logs/stdio
        - config.log: https://builder.sourceware.org/buildbot/#builders/77/builds/1921/steps/3/logs/config_log

- 4: make ( failure )
    Logs:
        - stdio: https://builder.sourceware.org/buildbot/#builders/77/builds/1921/steps/4/logs/stdio
        - warnings (6): https://builder.sourceware.org/buildbot/#builders/77/builds/1921/steps/4/logs/warnings__6_

A new failure has been detected on builder binutils-debian-ppc64 while building binutils-gdb.

Full details are available at:
    https://builder.sourceware.org/buildbot/#builders/78/builds/1897

Build state: failed compile (failure)
Revision: a82b3c5656d62a47173ddebab52819a2d0788de7
Worker: debian-ppc64
Build Reason: (unknown)
Blamelist: Jan Beulich <jbeulich@suse.com>

Steps:

- 0: worker_preparation ( success )

- 1: git checkout ( success )
    Logs:
        - stdio: https://builder.sourceware.org/buildbot/#builders/78/builds/1897/steps/1/logs/stdio

- 2: rm -rf binutils-build ( success )
    Logs:
        - stdio: https://builder.sourceware.org/buildbot/#builders/78/builds/1897/steps/2/logs/stdio

- 3: configure ( success )
    Logs:
        - stdio: https://builder.sourceware.org/buildbot/#builders/78/builds/1897/steps/3/logs/stdio
        - config.log: https://builder.sourceware.org/buildbot/#builders/78/builds/1897/steps/3/logs/config_log

- 4: make ( failure )
    Logs:
        - stdio: https://builder.sourceware.org/buildbot/#builders/78/builds/1897/steps/4/logs/stdio
        - warnings (7): https://builder.sourceware.org/buildbot/#builders/78/builds/1897/steps/4/logs/warnings__7_

A new failure has been detected on builder binutils-fedora-ppc64le while building binutils-gdb.

Full details are available at:
    https://builder.sourceware.org/buildbot/#builders/86/builds/1799

Build state: failed compile (failure)
Revision: a82b3c5656d62a47173ddebab52819a2d0788de7
Worker: fedora-ppc64le
Build Reason: (unknown)
Blamelist: Jan Beulich <jbeulich@suse.com>

Steps:

- 0: worker_preparation ( success )

- 1: git checkout ( success )
    Logs:
        - stdio: https://builder.sourceware.org/buildbot/#builders/86/builds/1799/steps/1/logs/stdio

- 2: rm -rf binutils-build ( success )
    Logs:
        - stdio: https://builder.sourceware.org/buildbot/#builders/86/builds/1799/steps/2/logs/stdio

- 3: configure ( success )
    Logs:
        - stdio: https://builder.sourceware.org/buildbot/#builders/86/builds/1799/steps/3/logs/stdio
        - config.log: https://builder.sourceware.org/buildbot/#builders/86/builds/1799/steps/3/logs/config_log

- 4: make ( failure )
    Logs:
        - stdio: https://builder.sourceware.org/buildbot/#builders/86/builds/1799/steps/4/logs/stdio
        - warnings (6): https://builder.sourceware.org/buildbot/#builders/86/builds/1799/steps/4/logs/warnings__6_

A new failure has been detected on builder binutils-opensusetw-x86_64 while building binutils-gdb.

Full details are available at:
    https://builder.sourceware.org/buildbot/#builders/102/builds/1801

Build state: failed compile (failure)
Revision: a82b3c5656d62a47173ddebab52819a2d0788de7
Worker: bb2-1
Build Reason: (unknown)
Blamelist: Jan Beulich <jbeulich@suse.com>

Steps:

- 0: worker_preparation ( success )

- 1: git checkout ( success )
    Logs:
        - stdio: https://builder.sourceware.org/buildbot/#builders/102/builds/1801/steps/1/logs/stdio

- 2: rm -rf binutils-build ( success )
    Logs:
        - stdio: https://builder.sourceware.org/buildbot/#builders/102/builds/1801/steps/2/logs/stdio

- 3: configure ( success )
    Logs:
        - stdio: https://builder.sourceware.org/buildbot/#builders/102/builds/1801/steps/3/logs/stdio
        - config.log: https://builder.sourceware.org/buildbot/#builders/102/builds/1801/steps/3/logs/config_log

- 4: make ( failure )
    Logs:
        - stdio: https://builder.sourceware.org/buildbot/#builders/102/builds/1801/steps/4/logs/stdio
        - warnings (7): https://builder.sourceware.org/buildbot/#builders/102/builds/1801/steps/4/logs/warnings__7_

A new failure has been detected on builder binutils-rawhide-x86_64 while building binutils-gdb.

Full details are available at:
    https://builder.sourceware.org/buildbot/#builders/133/builds/1655

Build state: failed compile (failure)
Revision: a82b3c5656d62a47173ddebab52819a2d0788de7
Worker: bb1-1
Build Reason: (unknown)
Blamelist: Jan Beulich <jbeulich@suse.com>

Steps:

- 0: worker_preparation ( success )

- 1: git checkout ( success )
    Logs:
        - stdio: https://builder.sourceware.org/buildbot/#builders/133/builds/1655/steps/1/logs/stdio

- 2: rm -rf binutils-build ( success )
    Logs:
        - stdio: https://builder.sourceware.org/buildbot/#builders/133/builds/1655/steps/2/logs/stdio

- 3: configure ( success )
    Logs:
        - stdio: https://builder.sourceware.org/buildbot/#builders/133/builds/1655/steps/3/logs/stdio
        - config.log: https://builder.sourceware.org/buildbot/#builders/133/builds/1655/steps/3/logs/config_log

- 4: make ( failure )
    Logs:
        - stdio: https://builder.sourceware.org/buildbot/#builders/133/builds/1655/steps/4/logs/stdio
        - warnings (8): https://builder.sourceware.org/buildbot/#builders/133/builds/1655/steps/4/logs/warnings__8_

A new failure has been detected on builder binutils-debian-testing-x86_64 while building binutils-gdb.

Full details are available at:
    https://builder.sourceware.org/buildbot/#builders/149/builds/1645

Build state: failed compile (failure)
Revision: a82b3c5656d62a47173ddebab52819a2d0788de7
Worker: bb1-2
Build Reason: (unknown)
Blamelist: Jan Beulich <jbeulich@suse.com>

Steps:

- 0: worker_preparation ( success )

- 1: git checkout ( success )
    Logs:
        - stdio: https://builder.sourceware.org/buildbot/#builders/149/builds/1645/steps/1/logs/stdio

- 2: rm -rf binutils-build ( success )
    Logs:
        - stdio: https://builder.sourceware.org/buildbot/#builders/149/builds/1645/steps/2/logs/stdio

- 3: configure ( success )
    Logs:
        - stdio: https://builder.sourceware.org/buildbot/#builders/149/builds/1645/steps/3/logs/stdio
        - config.log: https://builder.sourceware.org/buildbot/#builders/149/builds/1645/steps/3/logs/config_log

- 4: make ( failure )
    Logs:
        - stdio: https://builder.sourceware.org/buildbot/#builders/149/builds/1645/steps/4/logs/stdio
        - warnings (6): https://builder.sourceware.org/buildbot/#builders/149/builds/1645/steps/4/logs/warnings__6_

A new failure has been detected on builder binutils-ubuntu22_04-arm64 while building binutils-gdb.

Full details are available at:
    https://builder.sourceware.org/buildbot/#builders/221/builds/664

Build state: failed compile (failure)
Revision: a82b3c5656d62a47173ddebab52819a2d0788de7
Worker: arm64-ubuntu22_04
Build Reason: (unknown)
Blamelist: Jan Beulich <jbeulich@suse.com>

Steps:

- 0: worker_preparation ( success )

- 1: git checkout ( success )
    Logs:
        - stdio: https://builder.sourceware.org/buildbot/#builders/221/builds/664/steps/1/logs/stdio

- 2: rm -rf binutils-build ( success )
    Logs:
        - stdio: https://builder.sourceware.org/buildbot/#builders/221/builds/664/steps/2/logs/stdio

- 3: configure ( success )
    Logs:
        - stdio: https://builder.sourceware.org/buildbot/#builders/221/builds/664/steps/3/logs/stdio
        - config.log: https://builder.sourceware.org/buildbot/#builders/221/builds/664/steps/3/logs/config_log

- 4: make ( failure )
    Logs:
        - stdio: https://builder.sourceware.org/buildbot/#builders/221/builds/664/steps/4/logs/stdio
        - warnings (7): https://builder.sourceware.org/buildbot/#builders/221/builds/664/steps/4/logs/warnings__7_


^ permalink raw reply	[flat|nested] 29+ messages in thread

* ☠ Buildbot (Sourceware): binutils-gdb - failed compile (failure) (master)
@ 2023-04-14  0:30 builder
  0 siblings, 0 replies; 29+ messages in thread
From: builder @ 2023-04-14  0:30 UTC (permalink / raw)
  To: binutils

A new failure has been detected on builder binutils-opensuseleap-x86_64 while building binutils-gdb.

Full details are available at:
    https://builder.sourceware.org/buildbot/#builders/93/builds/1760

Build state: failed compile (failure)
Revision: 463b1a1ad2c573252b16465ab13cbb4f21975b6a
Worker: bbo1-1
Build Reason: (unknown)
Blamelist: GDB Administrator <gdbadmin@sourceware.org>, Tom Tromey <tromey@adacore.com>

Steps:

- 0: worker_preparation ( success )

- 1: git checkout ( success )
    Logs:
        - stdio: https://builder.sourceware.org/buildbot/#builders/93/builds/1760/steps/1/logs/stdio

- 2: rm -rf binutils-build ( success )
    Logs:
        - stdio: https://builder.sourceware.org/buildbot/#builders/93/builds/1760/steps/2/logs/stdio

- 3: configure ( success )
    Logs:
        - stdio: https://builder.sourceware.org/buildbot/#builders/93/builds/1760/steps/3/logs/stdio
        - config.log: https://builder.sourceware.org/buildbot/#builders/93/builds/1760/steps/3/logs/config_log

- 4: make ( failure )
    Logs:
        - stdio: https://builder.sourceware.org/buildbot/#builders/93/builds/1760/steps/4/logs/stdio
        - warnings (14): https://builder.sourceware.org/buildbot/#builders/93/builds/1760/steps/4/logs/warnings__14_

A new failure has been detected on builder binutils-rawhide-x86_64 while building binutils-gdb.

Full details are available at:
    https://builder.sourceware.org/buildbot/#builders/133/builds/1613

Build state: failed update (failure)
Revision: (unknown)
Worker: bbo1-1
Build Reason: (unknown)
Blamelist: GDB Administrator <gdbadmin@sourceware.org>, Tom Tromey <tromey@adacore.com>

Steps:

- 0: worker_preparation ( success )

- 1: git checkout ( failure )
    Logs:
        - stdio: https://builder.sourceware.org/buildbot/#builders/133/builds/1613/steps/1/logs/stdio


^ permalink raw reply	[flat|nested] 29+ messages in thread

* ☠ Buildbot (Sourceware): binutils-gdb - failed compile (failure) (master)
@ 2023-03-31  6:44 builder
  0 siblings, 0 replies; 29+ messages in thread
From: builder @ 2023-03-31  6:44 UTC (permalink / raw)
  To: binutils

A new failure has been detected on builder binutils-debian-amd64 while building binutils-gdb.

Full details are available at:
    https://builder.sourceware.org/buildbot/#builders/68/builds/1798

Build state: failed compile (failure)
Revision: f5b57feac2389eba64bea45f0115474fbbb13d8e
Worker: bb2-1
Build Reason: (unknown)
Blamelist: Richard Sandiford <richard.sandiford@arm.com>

Steps:

- 0: worker_preparation ( success )

- 1: git checkout ( success )
    Logs:
        - stdio: https://builder.sourceware.org/buildbot/#builders/68/builds/1798/steps/1/logs/stdio

- 2: rm -rf binutils-build ( success )
    Logs:
        - stdio: https://builder.sourceware.org/buildbot/#builders/68/builds/1798/steps/2/logs/stdio

- 3: configure ( success )
    Logs:
        - stdio: https://builder.sourceware.org/buildbot/#builders/68/builds/1798/steps/3/logs/stdio
        - config.log: https://builder.sourceware.org/buildbot/#builders/68/builds/1798/steps/3/logs/config_log

- 4: make ( failure )
    Logs:
        - stdio: https://builder.sourceware.org/buildbot/#builders/68/builds/1798/steps/4/logs/stdio
        - warnings (14): https://builder.sourceware.org/buildbot/#builders/68/builds/1798/steps/4/logs/warnings__14_

A new failure has been detected on builder binutils-fedora-x86_64 while building binutils-gdb.

Full details are available at:
    https://builder.sourceware.org/buildbot/#builders/77/builds/1782

Build state: failed compile (failure)
Revision: f5b57feac2389eba64bea45f0115474fbbb13d8e
Worker: bb1-1
Build Reason: (unknown)
Blamelist: Richard Sandiford <richard.sandiford@arm.com>

Steps:

- 0: worker_preparation ( success )

- 1: git checkout ( success )
    Logs:
        - stdio: https://builder.sourceware.org/buildbot/#builders/77/builds/1782/steps/1/logs/stdio

- 2: rm -rf binutils-build ( success )
    Logs:
        - stdio: https://builder.sourceware.org/buildbot/#builders/77/builds/1782/steps/2/logs/stdio

- 3: configure ( success )
    Logs:
        - stdio: https://builder.sourceware.org/buildbot/#builders/77/builds/1782/steps/3/logs/stdio
        - config.log: https://builder.sourceware.org/buildbot/#builders/77/builds/1782/steps/3/logs/config_log

- 4: make ( failure )
    Logs:
        - stdio: https://builder.sourceware.org/buildbot/#builders/77/builds/1782/steps/4/logs/stdio
        - warnings (6): https://builder.sourceware.org/buildbot/#builders/77/builds/1782/steps/4/logs/warnings__6_

A new failure has been detected on builder binutils-debian-ppc64 while building binutils-gdb.

Full details are available at:
    https://builder.sourceware.org/buildbot/#builders/78/builds/1758

Build state: failed compile (failure)
Revision: f5b57feac2389eba64bea45f0115474fbbb13d8e
Worker: debian-ppc64
Build Reason: (unknown)
Blamelist: Richard Sandiford <richard.sandiford@arm.com>

Steps:

- 0: worker_preparation ( success )

- 1: git checkout ( success )
    Logs:
        - stdio: https://builder.sourceware.org/buildbot/#builders/78/builds/1758/steps/1/logs/stdio

- 2: rm -rf binutils-build ( success )
    Logs:
        - stdio: https://builder.sourceware.org/buildbot/#builders/78/builds/1758/steps/2/logs/stdio

- 3: configure ( success )
    Logs:
        - stdio: https://builder.sourceware.org/buildbot/#builders/78/builds/1758/steps/3/logs/stdio
        - config.log: https://builder.sourceware.org/buildbot/#builders/78/builds/1758/steps/3/logs/config_log

- 4: make ( failure )
    Logs:
        - stdio: https://builder.sourceware.org/buildbot/#builders/78/builds/1758/steps/4/logs/stdio
        - warnings (7): https://builder.sourceware.org/buildbot/#builders/78/builds/1758/steps/4/logs/warnings__7_

A new failure has been detected on builder binutils-opensusetw-x86_64 while building binutils-gdb.

Full details are available at:
    https://builder.sourceware.org/buildbot/#builders/102/builds/1662

Build state: failed compile (failure)
Revision: f5b57feac2389eba64bea45f0115474fbbb13d8e
Worker: bbo1-2
Build Reason: (unknown)
Blamelist: Richard Sandiford <richard.sandiford@arm.com>

Steps:

- 0: worker_preparation ( success )

- 1: git checkout ( success )
    Logs:
        - stdio: https://builder.sourceware.org/buildbot/#builders/102/builds/1662/steps/1/logs/stdio

- 2: rm -rf binutils-build ( success )
    Logs:
        - stdio: https://builder.sourceware.org/buildbot/#builders/102/builds/1662/steps/2/logs/stdio

- 3: configure ( success )
    Logs:
        - stdio: https://builder.sourceware.org/buildbot/#builders/102/builds/1662/steps/3/logs/stdio
        - config.log: https://builder.sourceware.org/buildbot/#builders/102/builds/1662/steps/3/logs/config_log

- 4: make ( failure )
    Logs:
        - stdio: https://builder.sourceware.org/buildbot/#builders/102/builds/1662/steps/4/logs/stdio
        - warnings (7): https://builder.sourceware.org/buildbot/#builders/102/builds/1662/steps/4/logs/warnings__7_

A new failure has been detected on builder binutils-rawhide-x86_64 while building binutils-gdb.

Full details are available at:
    https://builder.sourceware.org/buildbot/#builders/133/builds/1516

Build state: failed compile (failure)
Revision: f5b57feac2389eba64bea45f0115474fbbb13d8e
Worker: bb2-1
Build Reason: (unknown)
Blamelist: Richard Sandiford <richard.sandiford@arm.com>

Steps:

- 0: worker_preparation ( success )

- 1: git checkout ( success )
    Logs:
        - stdio: https://builder.sourceware.org/buildbot/#builders/133/builds/1516/steps/1/logs/stdio

- 2: rm -rf binutils-build ( success )
    Logs:
        - stdio: https://builder.sourceware.org/buildbot/#builders/133/builds/1516/steps/2/logs/stdio

- 3: configure ( success )
    Logs:
        - stdio: https://builder.sourceware.org/buildbot/#builders/133/builds/1516/steps/3/logs/stdio
        - config.log: https://builder.sourceware.org/buildbot/#builders/133/builds/1516/steps/3/logs/config_log

- 4: make ( failure )
    Logs:
        - stdio: https://builder.sourceware.org/buildbot/#builders/133/builds/1516/steps/4/logs/stdio
        - warnings (8): https://builder.sourceware.org/buildbot/#builders/133/builds/1516/steps/4/logs/warnings__8_

A new failure has been detected on builder binutils-debian-testing-x86_64 while building binutils-gdb.

Full details are available at:
    https://builder.sourceware.org/buildbot/#builders/149/builds/1506

Build state: failed compile (failure)
Revision: f5b57feac2389eba64bea45f0115474fbbb13d8e
Worker: bb3
Build Reason: (unknown)
Blamelist: Richard Sandiford <richard.sandiford@arm.com>

Steps:

- 0: worker_preparation ( success )

- 1: git checkout ( success )
    Logs:
        - stdio: https://builder.sourceware.org/buildbot/#builders/149/builds/1506/steps/1/logs/stdio

- 2: rm -rf binutils-build ( success )
    Logs:
        - stdio: https://builder.sourceware.org/buildbot/#builders/149/builds/1506/steps/2/logs/stdio

- 3: configure ( success )
    Logs:
        - stdio: https://builder.sourceware.org/buildbot/#builders/149/builds/1506/steps/3/logs/stdio
        - config.log: https://builder.sourceware.org/buildbot/#builders/149/builds/1506/steps/3/logs/config_log

- 4: make ( failure )
    Logs:
        - stdio: https://builder.sourceware.org/buildbot/#builders/149/builds/1506/steps/4/logs/stdio
        - warnings (6): https://builder.sourceware.org/buildbot/#builders/149/builds/1506/steps/4/logs/warnings__6_

A new failure has been detected on builder binutils-ubuntu22_04-arm64 while building binutils-gdb.

Full details are available at:
    https://builder.sourceware.org/buildbot/#builders/221/builds/525

Build state: failed compile (failure)
Revision: f5b57feac2389eba64bea45f0115474fbbb13d8e
Worker: arm64-ubuntu22_04
Build Reason: (unknown)
Blamelist: Richard Sandiford <richard.sandiford@arm.com>

Steps:

- 0: worker_preparation ( success )

- 1: git checkout ( success )
    Logs:
        - stdio: https://builder.sourceware.org/buildbot/#builders/221/builds/525/steps/1/logs/stdio

- 2: rm -rf binutils-build ( success )
    Logs:
        - stdio: https://builder.sourceware.org/buildbot/#builders/221/builds/525/steps/2/logs/stdio

- 3: configure ( success )
    Logs:
        - stdio: https://builder.sourceware.org/buildbot/#builders/221/builds/525/steps/3/logs/stdio
        - config.log: https://builder.sourceware.org/buildbot/#builders/221/builds/525/steps/3/logs/config_log

- 4: make ( failure )
    Logs:
        - stdio: https://builder.sourceware.org/buildbot/#builders/221/builds/525/steps/4/logs/stdio
        - warnings (7): https://builder.sourceware.org/buildbot/#builders/221/builds/525/steps/4/logs/warnings__7_


^ permalink raw reply	[flat|nested] 29+ messages in thread

* ☠ Buildbot (Sourceware): binutils-gdb - failed compile (failure) (master)
@ 2023-03-07 16:17 builder
  0 siblings, 0 replies; 29+ messages in thread
From: builder @ 2023-03-07 16:17 UTC (permalink / raw)
  To: binutils

A new failure has been detected on builder binutils-debian-armhf while building binutils-gdb.

Full details are available at:
    https://builder.sourceware.org/buildbot/#builders/80/builds/1316

Build state: failed compile (failure)
Revision: 3a80a48386ac12d04aa98802cf497a394d0bb74c
Worker: debian-armhf
Build Reason: (unknown)
Blamelist: Ulf Samuelsson <ulf@emagii.com>

Steps:

- 0: worker_preparation ( success )

- 1: git checkout ( success )
    Logs:
        - stdio: https://builder.sourceware.org/buildbot/#builders/80/builds/1316/steps/1/logs/stdio

- 2: rm -rf binutils-build ( success )
    Logs:
        - stdio: https://builder.sourceware.org/buildbot/#builders/80/builds/1316/steps/2/logs/stdio

- 3: configure ( success )
    Logs:
        - stdio: https://builder.sourceware.org/buildbot/#builders/80/builds/1316/steps/3/logs/stdio
        - config.log: https://builder.sourceware.org/buildbot/#builders/80/builds/1316/steps/3/logs/config_log

- 4: make ( failure )
    Logs:
        - stdio: https://builder.sourceware.org/buildbot/#builders/80/builds/1316/steps/4/logs/stdio
        - warnings (37): https://builder.sourceware.org/buildbot/#builders/80/builds/1316/steps/4/logs/warnings__37_


^ permalink raw reply	[flat|nested] 29+ messages in thread

* ☠ Buildbot (Sourceware): binutils-gdb - failed compile (failure) (master)
@ 2023-01-17 11:46 builder
  0 siblings, 0 replies; 29+ messages in thread
From: builder @ 2023-01-17 11:46 UTC (permalink / raw)
  To: binutils

A new failure has been detected on builder binutils-debian-amd64 while building binutils-gdb.

Full details are available at:
    https://builder.sourceware.org/buildbot/#builders/68/builds/1348

Build state: failed compile (failure)
Revision: fd1b3e0e8dbf5313bededeab9c9c4ed2da5a0693
Worker: bb2-2
Build Reason: (unknown)
Blamelist: Xianmiao Qu <cooper.qu@linux.alibaba.com>

Steps:

- 0: worker_preparation ( success )

- 1: git checkout ( success )
    Logs:
        - stdio: https://builder.sourceware.org/buildbot/#builders/68/builds/1348/steps/1/logs/stdio

- 2: rm -rf binutils-build ( success )
    Logs:
        - stdio: https://builder.sourceware.org/buildbot/#builders/68/builds/1348/steps/2/logs/stdio

- 3: configure ( success )
    Logs:
        - stdio: https://builder.sourceware.org/buildbot/#builders/68/builds/1348/steps/3/logs/stdio

- 4: make ( failure )
    Logs:
        - stdio: https://builder.sourceware.org/buildbot/#builders/68/builds/1348/steps/4/logs/stdio
        - warnings (6): https://builder.sourceware.org/buildbot/#builders/68/builds/1348/steps/4/logs/warnings__6_

A new failure has been detected on builder binutils-fedora-x86_64 while building binutils-gdb.

Full details are available at:
    https://builder.sourceware.org/buildbot/#builders/77/builds/1332

Build state: failed compile (failure)
Revision: fd1b3e0e8dbf5313bededeab9c9c4ed2da5a0693
Worker: bb2-1
Build Reason: (unknown)
Blamelist: Xianmiao Qu <cooper.qu@linux.alibaba.com>

Steps:

- 0: worker_preparation ( success )

- 1: git checkout ( success )
    Logs:
        - stdio: https://builder.sourceware.org/buildbot/#builders/77/builds/1332/steps/1/logs/stdio

- 2: rm -rf binutils-build ( success )
    Logs:
        - stdio: https://builder.sourceware.org/buildbot/#builders/77/builds/1332/steps/2/logs/stdio

- 3: configure ( success )
    Logs:
        - stdio: https://builder.sourceware.org/buildbot/#builders/77/builds/1332/steps/3/logs/stdio

- 4: make ( failure )
    Logs:
        - stdio: https://builder.sourceware.org/buildbot/#builders/77/builds/1332/steps/4/logs/stdio
        - warnings (6): https://builder.sourceware.org/buildbot/#builders/77/builds/1332/steps/4/logs/warnings__6_

A new failure has been detected on builder binutils-debian-ppc64 while building binutils-gdb.

Full details are available at:
    https://builder.sourceware.org/buildbot/#builders/78/builds/1329

Build state: failed compile (failure)
Revision: fd1b3e0e8dbf5313bededeab9c9c4ed2da5a0693
Worker: debian-ppc64
Build Reason: (unknown)
Blamelist: Xianmiao Qu <cooper.qu@linux.alibaba.com>

Steps:

- 0: worker_preparation ( success )

- 1: git checkout ( success )
    Logs:
        - stdio: https://builder.sourceware.org/buildbot/#builders/78/builds/1329/steps/1/logs/stdio

- 2: rm -rf binutils-build ( success )
    Logs:
        - stdio: https://builder.sourceware.org/buildbot/#builders/78/builds/1329/steps/2/logs/stdio

- 3: configure ( success )
    Logs:
        - stdio: https://builder.sourceware.org/buildbot/#builders/78/builds/1329/steps/3/logs/stdio

- 4: make ( failure )
    Logs:
        - stdio: https://builder.sourceware.org/buildbot/#builders/78/builds/1329/steps/4/logs/stdio
        - warnings (7): https://builder.sourceware.org/buildbot/#builders/78/builds/1329/steps/4/logs/warnings__7_

A new failure has been detected on builder binutils-debian-armhf while building binutils-gdb.

Full details are available at:
    https://builder.sourceware.org/buildbot/#builders/80/builds/1115

Build state: failed compile (failure)
Revision: fd1b3e0e8dbf5313bededeab9c9c4ed2da5a0693
Worker: debian-armhf
Build Reason: (unknown)
Blamelist: Xianmiao Qu <cooper.qu@linux.alibaba.com>

Steps:

- 0: worker_preparation ( success )

- 1: git checkout ( success )
    Logs:
        - stdio: https://builder.sourceware.org/buildbot/#builders/80/builds/1115/steps/1/logs/stdio

- 2: rm -rf binutils-build ( success )
    Logs:
        - stdio: https://builder.sourceware.org/buildbot/#builders/80/builds/1115/steps/2/logs/stdio

- 3: configure ( success )
    Logs:
        - stdio: https://builder.sourceware.org/buildbot/#builders/80/builds/1115/steps/3/logs/stdio

- 4: make ( failure )
    Logs:
        - stdio: https://builder.sourceware.org/buildbot/#builders/80/builds/1115/steps/4/logs/stdio
        - warnings (15): https://builder.sourceware.org/buildbot/#builders/80/builds/1115/steps/4/logs/warnings__15_

A new failure has been detected on builder binutils-fedora-ppc64le while building binutils-gdb.

Full details are available at:
    https://builder.sourceware.org/buildbot/#builders/86/builds/1290

Build state: failed compile (failure)
Revision: fd1b3e0e8dbf5313bededeab9c9c4ed2da5a0693
Worker: fedora-ppc64le
Build Reason: (unknown)
Blamelist: Xianmiao Qu <cooper.qu@linux.alibaba.com>

Steps:

- 0: worker_preparation ( success )

- 1: git checkout ( success )
    Logs:
        - stdio: https://builder.sourceware.org/buildbot/#builders/86/builds/1290/steps/1/logs/stdio

- 2: rm -rf binutils-build ( success )
    Logs:
        - stdio: https://builder.sourceware.org/buildbot/#builders/86/builds/1290/steps/2/logs/stdio

- 3: configure ( success )
    Logs:
        - stdio: https://builder.sourceware.org/buildbot/#builders/86/builds/1290/steps/3/logs/stdio

- 4: make ( failure )
    Logs:
        - stdio: https://builder.sourceware.org/buildbot/#builders/86/builds/1290/steps/4/logs/stdio
        - warnings (6): https://builder.sourceware.org/buildbot/#builders/86/builds/1290/steps/4/logs/warnings__6_

A new failure has been detected on builder binutils-opensuseleap-x86_64 while building binutils-gdb.

Full details are available at:
    https://builder.sourceware.org/buildbot/#builders/93/builds/1213

Build state: failed compile (failure)
Revision: fd1b3e0e8dbf5313bededeab9c9c4ed2da5a0693
Worker: bb1-2
Build Reason: (unknown)
Blamelist: Xianmiao Qu <cooper.qu@linux.alibaba.com>

Steps:

- 0: worker_preparation ( success )

- 1: git checkout ( success )
    Logs:
        - stdio: https://builder.sourceware.org/buildbot/#builders/93/builds/1213/steps/1/logs/stdio

- 2: rm -rf binutils-build ( success )
    Logs:
        - stdio: https://builder.sourceware.org/buildbot/#builders/93/builds/1213/steps/2/logs/stdio

- 3: configure ( success )
    Logs:
        - stdio: https://builder.sourceware.org/buildbot/#builders/93/builds/1213/steps/3/logs/stdio

- 4: make ( failure )
    Logs:
        - stdio: https://builder.sourceware.org/buildbot/#builders/93/builds/1213/steps/4/logs/stdio
        - warnings (6): https://builder.sourceware.org/buildbot/#builders/93/builds/1213/steps/4/logs/warnings__6_

A new failure has been detected on builder binutils-opensusetw-x86_64 while building binutils-gdb.

Full details are available at:
    https://builder.sourceware.org/buildbot/#builders/102/builds/1211

Build state: failed compile (failure)
Revision: fd1b3e0e8dbf5313bededeab9c9c4ed2da5a0693
Worker: bb1-1
Build Reason: (unknown)
Blamelist: Xianmiao Qu <cooper.qu@linux.alibaba.com>

Steps:

- 0: worker_preparation ( success )

- 1: git checkout ( success )
    Logs:
        - stdio: https://builder.sourceware.org/buildbot/#builders/102/builds/1211/steps/1/logs/stdio

- 2: rm -rf binutils-build ( success )
    Logs:
        - stdio: https://builder.sourceware.org/buildbot/#builders/102/builds/1211/steps/2/logs/stdio

- 3: configure ( success )
    Logs:
        - stdio: https://builder.sourceware.org/buildbot/#builders/102/builds/1211/steps/3/logs/stdio

- 4: make ( failure )
    Logs:
        - stdio: https://builder.sourceware.org/buildbot/#builders/102/builds/1211/steps/4/logs/stdio
        - warnings (7): https://builder.sourceware.org/buildbot/#builders/102/builds/1211/steps/4/logs/warnings__7_

A new failure has been detected on builder binutils-rawhide-x86_64 while building binutils-gdb.

Full details are available at:
    https://builder.sourceware.org/buildbot/#builders/133/builds/1066

Build state: failed compile (failure)
Revision: fd1b3e0e8dbf5313bededeab9c9c4ed2da5a0693
Worker: bb1-2
Build Reason: (unknown)
Blamelist: Xianmiao Qu <cooper.qu@linux.alibaba.com>

Steps:

- 0: worker_preparation ( success )

- 1: git checkout ( success )
    Logs:
        - stdio: https://builder.sourceware.org/buildbot/#builders/133/builds/1066/steps/1/logs/stdio

- 2: rm -rf binutils-build ( success )
    Logs:
        - stdio: https://builder.sourceware.org/buildbot/#builders/133/builds/1066/steps/2/logs/stdio

- 3: configure ( success )
    Logs:
        - stdio: https://builder.sourceware.org/buildbot/#builders/133/builds/1066/steps/3/logs/stdio

- 4: make ( failure )
    Logs:
        - stdio: https://builder.sourceware.org/buildbot/#builders/133/builds/1066/steps/4/logs/stdio
        - warnings (8): https://builder.sourceware.org/buildbot/#builders/133/builds/1066/steps/4/logs/warnings__8_

A new failure has been detected on builder binutils-debian-testing-x86_64 while building binutils-gdb.

Full details are available at:
    https://builder.sourceware.org/buildbot/#builders/149/builds/1055

Build state: failed compile (failure)
Revision: fd1b3e0e8dbf5313bededeab9c9c4ed2da5a0693
Worker: bb1-1
Build Reason: (unknown)
Blamelist: Xianmiao Qu <cooper.qu@linux.alibaba.com>

Steps:

- 0: worker_preparation ( success )

- 1: git checkout ( success )
    Logs:
        - stdio: https://builder.sourceware.org/buildbot/#builders/149/builds/1055/steps/1/logs/stdio

- 2: rm -rf binutils-build ( success )
    Logs:
        - stdio: https://builder.sourceware.org/buildbot/#builders/149/builds/1055/steps/2/logs/stdio

- 3: configure ( success )
    Logs:
        - stdio: https://builder.sourceware.org/buildbot/#builders/149/builds/1055/steps/3/logs/stdio

- 4: make ( failure )
    Logs:
        - stdio: https://builder.sourceware.org/buildbot/#builders/149/builds/1055/steps/4/logs/stdio
        - warnings (6): https://builder.sourceware.org/buildbot/#builders/149/builds/1055/steps/4/logs/warnings__6_

A new failure has been detected on builder binutils-ubuntu22_04-arm64 while building binutils-gdb.

Full details are available at:
    https://builder.sourceware.org/buildbot/#builders/221/builds/75

Build state: failed compile (failure)
Revision: fd1b3e0e8dbf5313bededeab9c9c4ed2da5a0693
Worker: arm64-ubuntu22_04
Build Reason: (unknown)
Blamelist: Xianmiao Qu <cooper.qu@linux.alibaba.com>

Steps:

- 0: worker_preparation ( success )

- 1: git checkout ( success )
    Logs:
        - stdio: https://builder.sourceware.org/buildbot/#builders/221/builds/75/steps/1/logs/stdio

- 2: rm -rf binutils-build ( success )
    Logs:
        - stdio: https://builder.sourceware.org/buildbot/#builders/221/builds/75/steps/2/logs/stdio

- 3: configure ( success )
    Logs:
        - stdio: https://builder.sourceware.org/buildbot/#builders/221/builds/75/steps/3/logs/stdio

- 4: make ( failure )
    Logs:
        - stdio: https://builder.sourceware.org/buildbot/#builders/221/builds/75/steps/4/logs/stdio
        - warnings (7): https://builder.sourceware.org/buildbot/#builders/221/builds/75/steps/4/logs/warnings__7_

A new failure has been detected on builder binutils-ubuntu20_04-arm64 while building binutils-gdb.

Full details are available at:
    https://builder.sourceware.org/buildbot/#builders/222/builds/75

Build state: failed compile (failure)
Revision: fd1b3e0e8dbf5313bededeab9c9c4ed2da5a0693
Worker: arm64-ubuntu20_04
Build Reason: (unknown)
Blamelist: Xianmiao Qu <cooper.qu@linux.alibaba.com>

Steps:

- 0: worker_preparation ( success )

- 1: git checkout ( success )
    Logs:
        - stdio: https://builder.sourceware.org/buildbot/#builders/222/builds/75/steps/1/logs/stdio

- 2: rm -rf binutils-build ( success )
    Logs:
        - stdio: https://builder.sourceware.org/buildbot/#builders/222/builds/75/steps/2/logs/stdio

- 3: configure ( success )
    Logs:
        - stdio: https://builder.sourceware.org/buildbot/#builders/222/builds/75/steps/3/logs/stdio

- 4: make ( failure )
    Logs:
        - stdio: https://builder.sourceware.org/buildbot/#builders/222/builds/75/steps/4/logs/stdio
        - warnings (7): https://builder.sourceware.org/buildbot/#builders/222/builds/75/steps/4/logs/warnings__7_


^ permalink raw reply	[flat|nested] 29+ messages in thread

end of thread, other threads:[~2024-01-29 19:38 UTC | newest]

Thread overview: 29+ messages (download: mbox.gz / follow: Atom feed)
-- links below jump to the message on this page --
2023-08-18 17:45 ☠ Buildbot (Sourceware): binutils-gdb - failed compile (failure) (master) builder
  -- strict thread matches above, loose matches on Subject: below --
2024-01-29 19:38 builder
2024-01-22  0:59 builder
2024-01-16 11:31 builder
2024-01-16 10:22 builder
2023-12-29  7:43 builder
2023-11-24  9:13 builder
2023-10-13 14:40 builder
2023-10-13 14:48 ` Clément Chigot
2023-10-06 20:07 builder
2023-09-25  9:56 builder
2023-09-25  9:22 builder
2023-08-02  9:02 builder
2023-07-27 14:32 builder
2023-07-21 12:06 builder
2023-07-19  0:43 builder
2023-05-26  9:02 builder
2023-05-26  7:16 builder
2023-05-23  6:10 builder
2023-04-24  0:31 builder
2023-04-24  6:04 ` Jan Beulich
2023-04-24 10:33   ` Alan Modra
2023-04-24 10:39     ` Jan Beulich
2023-04-24 11:48     ` Mark Wielaard
2023-04-21 13:56 builder
2023-04-14  0:30 builder
2023-03-31  6:44 builder
2023-03-07 16:17 builder
2023-01-17 11:46 builder

This is a public inbox, see mirroring instructions
for how to clone and mirror all data and code used for this inbox;
as well as URLs for read-only IMAP folder(s) and NNTP newsgroup(s).